1,3-Cyclohexanedione, 2-methyl-

Phase change data

Data compiled by: Thermodynamics Research Center, NIST Boulder Laboratories, Chris Muzny director

Quantity Value Units Method Reference Comment
Tfus482.KN/AWolfrom and Bobbitt, 1956Uncertainty assigned by TRC = 3. K

In addition to the Thermodynamics Research Center (TRC) data available from this site, much more physical and chemical property data is available from the following TRC products:

Gas phase ion energetics data

Data compiled by: Sharon G. Lias, Rhoda D. Levin, and Sherif A. Kafafi

Ionization energy determinations

IE (eV) Method Reference
9.37 ± 0.05PEHouk, Davis, et al., 1973

References

Wolfrom and Bobbitt, 1956
Wolfrom, M.L.; Bobbitt, J.M., Periodate Oxidation of Cyclic 1,3-Diketones, J. Am. Chem. Soc., 1956, 78, 2489-93. [all data]