Phenol, 4-methyl-2-nitro-

Normal alkane RI, polar column, custom temperature program

Data compiled by: NIST Mass Spectrometry Data Center, William E. Wallace, director

Column type CapillaryCapillaryCapillaryCapillary
Active phase DB-WaxDB-WaxDB-WaxDB-Wax
Column length (m)
Carrier gas
Substrate
Column diameter (mm)
Phase thickness (μm)
Program not specifiednot specifiednot specifiednot specified
I 1914.1919.1919.1922.
ReferenceSteullet and Guerin, 1994Steullet and Guerin, 1994Steullet and Guerin, 1994Steullet and Guerin, 1994
Comment MSDC-RI MSDC-RI MSDC-RI MSDC-RI

Van Den Dool and Kratz RI, non-polar column, temperature ramp

Data compiled by: NIST Mass Spectrometry Data Center, William E. Wallace, director

Column type Capillary
Active phase HP-5MS
Column length (m) 30.
Carrier gas He
Substrate
Column diameter (mm) 0.25
Phase thickness (μm) 0.25
Tstart (C) 80.
Tend (C) 300.
Heat rate (K/min) 4.
Initial hold (min)
Final hold (min)
I 1249.8
ReferenceZhao C.X., Li, et al., 2006
Comment MSDC-RI

References

Steullet and Guerin, 1994
Steullet, P.; Guerin, P.M., Identification of vertebrate volatiles stimulating olfactory receptors on tarsus I of the tick Amblyomma variegatum fabricus (Ixodidae). II. Receptors outside the Haller's organ capsule, J. Comp. Physiol. A, 1994, 174, 1, 39-47, https://doi.org/10.1007/BF00192004 . [all data]