1H-Pyrrole-2-carboxaldehyde, 5-methyl-

Van Den Dool and Kratz RI, non-polar column, temperature ramp

View large format table.

Column type Active phase I Reference Comment
CapillaryHP-11092.Zhang, Dorjpalam, et al., 199250. m/0.32 mm/1.5 μm, 2. K/min, 220. C @ 30. min; Tstart: 40. C

Normal alkane RI, non-polar column, temperature ramp

View large format table.

Column type Active phase I Reference Comment
CapillaryDB-11105.Chen and Ho, 199860. m/0.32 mm/1.0 μm, He, 3. K/min; Tstart: 40. C; Tend: 260. C
CapillaryDB-11099.Tai and Ho, 199860. m/0.32 mm/1.0 μm, He, 2. K/min; Tstart: 40. C; Tend: 280. C

Normal alkane RI, polar column, temperature ramp

View large format table.

Column type Active phase I Reference Comment
CapillaryDB-Wax2046.Fujioka and Shibamoto, 200660. m/0.25 mm/0.25 μm, He, 2. K/min, 200. C @ 90. min; Tstart: 50. C
CapillaryFFAP2030.Vernin, Metzger, et al., 1988He, 60. C @ 5. min, 2. K/min; Column length: 50. m; Column diameter: 0.28 mm; Tend: 240. C

Normal alkane RI, polar column, custom temperature program

View large format table.

Column type Active phase I Reference Comment
CapillaryDB-Wax2079.Krings, Zelena, et al., 200630. m/0.32 mm/0.25 μm, He; Program: 45C(5min) => 5C/min => 150C => 10C/min => 240C (10min)

References

Zhang, Dorjpalam, et al., 1992
Zhang, Y.; Dorjpalam, B.; Ho, C.-T., Contribution of peptides to volatile formation in the Maillard reaction of casein hydrolysate with glucose, J. Agric. Food Chem., 1992, 40, 12, 2467-2471, https://doi.org/10.1021/jf00024a026 . [all data]

Chen and Ho, 1998
Chen, J.; Ho, C.-T., Volatile compounds formed from thermal degradation of glucosamine in a dry system, J. Agric. Food Chem., 1998, 46, 5, 1971-1974, https://doi.org/10.1021/jf971021o . [all data]

Tai and Ho, 1998
Tai, C.-Y.; Ho, C.-T., Influence of glutathione oxidation and pH on thermal formation of Maillard-type volatile compounds, J. Agric. Food Chem., 1998, 46, 6, 2260-2265, https://doi.org/10.1021/jf971111t . [all data]

Fujioka and Shibamoto, 2006
Fujioka, K.; Shibamoto, T., Quantitation of volatiles and nonvolatile acids in an extract from coffee beverages: correlation with antioxidant activity, J. Agric. Food Chem., 2006, 54, 16, 6054-6058, https://doi.org/10.1021/jf060460x . [all data]

Vernin, Metzger, et al., 1988
Vernin, G.; Metzger, J.; Obretenov, T.; Suon, K.-N.; Fraisse, D., GC/MS (EI,PCI,SIM)-data bank analysis of volatile compounds arising from thermal degradation of glucose-valine amadori intermediates in Flavors and Fragrances: A World Perspective. Proceedings of the 10th International Congress of Essential Oils, Fragrances and Flavors, Lawrence,B.M.; Mookherjee,B.D.; Willis,B.J., ed(s)., Elsevier, New York, 1988, 999-1028. [all data]

Krings, Zelena, et al., 2006
Krings, U.; Zelena, K.; Wu, S.; Berger, R.G., Thin-layer high-vacuum distillation to isolate volatile flavour compounds of cocoa powder, Eur. Food Res. Technol., 2006, 223, 5, 675-681, https://doi.org/10.1007/s00217-006-0252-x . [all data]