Methyl eicosa-5,8,11,14,17-pentaenoate

Normal alkane RI, polar column, custom temperature program

View large format table.

Column type Active phase I Reference Comment
CapillaryCP-Wax 52CB2174.Mjos, Meier, et al., 200625. m/0.25 mm/0.20 μm, He; Program: 90 0C (2 min) 15 0C/min -> 160 0C 2.5 0C/min -> 225 0C (3 min) 10 0C/min -> 240 0C (50 min)

References

Mjos, Meier, et al., 2006
Mjos, S.A.; Meier, S.; Grahl-Nielsen, O., Geometrical isomerisation of double bonds in acid-catalysed preparation of fatty acid methyl esters, Eur. J. Lipid Sci. Technol., 2006, 108, 4, 315-322, https://doi.org/10.1002/ejlt.200500298 . [all data]