p-Nitrobenzoylbenzoin

Condensed phase thermochemistry data

Data compiled by: Hussein Y. Afeefy, Joel F. Liebman, and Stephen E. Stein

Quantity Value Units Method Reference Comment
Δcsolid-2443.4kcal/molCcbBarker, 1925

References

Barker, 1925
Barker, M.F., Calorific value and constitution, J. Phys. Chem., 1925, 29, 1345-1363. [all data]