Eudesma-4(15),7-dien-1β -ol

Kovats' RI, non-polar column, custom temperature program

Data compiled by: NIST Mass Spectrometry Data Center, William E. Wallace, director

Column type Capillary
Active phase CP Sil 8 CB
Column length (m) 50.
Carrier gas He
Substrate
Column diameter (mm) 0.32
Phase thickness (μm) 0.25
Program 60C(1min) => 3C/min => 70C => 15C/min => 170C(8min) => 5C/min => 250C
I 1688.
ReferenceRadusiene, Judzentiene, et al., 2005
Comment MSDC-RI

References

Radusiene, Judzentiene, et al., 2005
Radusiene, J.; Judzentiene, A.; Bernotiene, G., Essential oil composition and variability of Hypericum perforatum L. growing in Lithuania, Biochem. Syst. Ecol., 2005, 33, 2, 113-124, https://doi.org/10.1016/j.bse.2004.06.010 . [all data]