Propanedioic acid, dibutyl ester

Phase change data

Data compiled by: Thermodynamics Research Center, NIST Boulder Laboratories, Chris Muzny director

Quantity Value Units Method Reference Comment
Tfus178.KN/APalomaa and Mikkila, 1942Uncertainty assigned by TRC = 3. K

In addition to the Thermodynamics Research Center (TRC) data available from this site, much more physical and chemical property data is available from the following TRC products:

References

Palomaa and Mikkila, 1942
Palomaa, M.H.; Mikkila, I., Etherlike Compounds XXVII Turbid Phases in Compounds with Reactivity Minimums, Chem. Ber., 1942, 75B, 1659-67. [all data]