3-[(1-Oxoheptyl)oxy]-estra-1,3,5(10)-trien-17-one

Phase change data

Data compiled by: William E. Acree, Jr., James S. Chickos

Enthalpy of fusion

ΔfusH (kcal/mol) Temperature (K) Method Reference
5.0338.DSCYano, Eiraku, et al., 1990

References

Yano, Eiraku, et al., 1990
Yano, Shinichi; Eiraku, Michitaka; Tomiyama, Makoto; Sugihara, Toshiharu, Mesogenicity of testosterone and estrone derivatives, Liquid Crystals, 1990, 7, 4, 537-544, https://doi.org/10.1080/02678299008033830 . [all data]