trans-Geranic acid methyl ester

Kovats' RI, non-polar column, isothermal

Data compiled by: NIST Mass Spectrometry Data Center, William E. Wallace, director

Column type Capillary
Active phase Apiezon L
Column length (m)
Carrier gas
Substrate
Column diameter (mm)
Phase thickness (μm)
Temperature (C) 150.
I 1270.
Referenceter Heide, de Valois, et al., 1975
Comment MSDC-RI

References

ter Heide, de Valois, et al., 1975
ter Heide, R.; de Valois, P.J.; Wobben, H.J.; Timmer, R., Analysis of the acid fraction of the reunion geranium oil (Pelargonium graveolens L'Her. ex Ait), J. Agric. Food Chem., 1975, 23, 1, 57-60, https://doi.org/10.1021/jf60197a010 . [all data]