Gallium, triethenyl-

Gas phase ion energetics data

Data compiled by: Sharon G. Lias, Rhoda D. Levin, and Sherif A. Kafafi

Ionization energy determinations

IE (eV) Method Reference
10.8 ± 0.1EIGlockling and Strafford, 1971

Appearance energy determinations

Ion AE (eV) Other Products MethodReferenceComment
C2H3Ga+10.95 ± 0.05C4H6EIGlockling and Strafford, 1971
C2H4Ga+11.85 ± 0.05C2H3+C2H2EIGlockling and Strafford, 1971
C4H6Ga+11.04 ± 0.08C2H3EIGlockling and Strafford, 1971
Ga+11.17 ± 0.05C4H6+C2H3EIGlockling and Strafford, 1971

References

Glockling and Strafford, 1971
Glockling, F.; Strafford, R.G., Electron impact studies on some group III metal alkyls, J. Chem. Soc. A, 1971, 1761. [all data]