trifluoro(trifluoromethoxy)ethylene

Phase change data

Data compiled by: William E. Acree, Jr., James S. Chickos

Quantity Value Units Method Reference Comment
Δvap20.3kJ/molN/ALiu, Liu, et al., 2007Based on data from 248. - 338. K.

Enthalpy of vaporization

ΔvapH (kJ/mol) Temperature (K) Method Reference Comment
22.9226.AStephenson and Malanowski, 1987Based on data from 208. - 241. K.

References

Liu, Liu, et al., 2007
Liu, L.-S.; Liu, W.-S.; Zhou, N.; Fan, X.-N.; Song, H.; Fu, C.; Yang, Y.-Y., Gaoxiao Huaxue Gongcheng Xuebao, 2007, 21, 5, 875. [all data]

Stephenson and Malanowski, 1987
Stephenson, Richard M.; Malanowski, Stanislaw, Handbook of the Thermodynamics of Organic Compounds, 1987, https://doi.org/10.1007/978-94-009-3173-2 . [all data]