Trimethyl methanetricarboxylate

Phase change data

Data compiled as indicated in comments:
BS - Robert L. Brown and Stephen E. Stein
ALS - Hussein Y. Afeefy, Joel F. Liebman, and Stephen E. Stein
DRB - Donald R. Burgess, Jr.

Quantity Value Units Method Reference Comment
Tboil515.9KN/AWeast and Grasselli, 1989BS
Quantity Value Units Method Reference Comment
Δsub22.1 ± 0.2kcal/molVRakus, Verevkin, et al., 1995ALS
Δsub22.1kcal/molN/ARakus, Verevkin, et al., 1995DRB

Reduced pressure boiling point

Tboil (K) Pressure (atm) Reference Comment
401.20.020Weast and Grasselli, 1989BS

References

Weast and Grasselli, 1989
CRC Handbook of Data on Organic Compounds, 2nd Editon, Weast,R.C and Grasselli, J.G., ed(s)., CRC Press, Inc., Boca Raton, FL, 1989, 1. [all data]

Rakus, Verevkin, et al., 1995
Rakus, K.; Verevkin, S.P.; Keller, M.; Beckhaus, H.-D.; Ruchardt, C., Radical stabilization enthalpies of α,α-bis(methoxycarbonyl)alkyl and tris(methoxycarbonyl)methyl radicals, Liebigs Ann. Chem., 1995, 1483-1493. [all data]