Bicyclo[7.2.0]undec-4-ene, 4,11,11-trimethyl-8-methylene-,[1R-(1R*,4Z,9S*)]-

Normal alkane RI, non-polar column, custom temperature program

Data compiled by: NIST Mass Spectrometry Data Center, William E. Wallace, director

Column type CapillaryCapillaryCapillaryCapillaryCapillary
Active phase Siloxane, 5 % PhHP-5HP-5 MSPolydimethyl siloxane, 5 % phenylDB-5
Column length (m)  30.30. 30.
Carrier gas  HeliumHelium Helium
Substrate
Column diameter (mm)  0.320.25 0.25
Phase thickness (μm)  0.250.25 0.25
Program not specifiednot specified40 0C (10 min) 3 0C/min -> 200 0C 2 0C/min -> 220 0Cnot specified50 0C m6 0C/min -> 140 0C 5 0C/min -> 160 0C (1 min) 10 0C/min -> 200 0C
I 1414.1409.1405.1414.1411.
ReferenceVOC BinBase, 2012Kahriman, Tosun, et al., 2011Nance and Setzer, 2011Skogerson, Wohlgemuth, et al., 2011Courtois, Paine, et al., 2009
Comment MSDC-RI MSDC-RI MSDC-RI MSDC-RI MSDC-RI
Column type CapillaryCapillaryCapillaryCapillaryCapillary
Active phase CB-1CB-1CP-Sil 8CB-MSCP-SilSE-52
Column length (m) 30.30.30.30.30.
Carrier gas HeliumHeliumHeliumHeliumHe
Substrate
Column diameter (mm) 0.250.250.250.250.32
Phase thickness (μm) 0.250.250.250.250.15
Program 40 0C (2 min) 4 0C/min -> 180 0C 20 0C/min -> 220 0C (1 min)not specified50 0C(3 min) 3 0C/min -> 100 0C 2.7 0C/min -> 140 0C 2.4 0C/min -> 180 0C 6 0C/min -> 260 0C50 0C (3 min) 3 0C/min -> 100 0C 2.7 0C/min -> 140 0C 2.4 0C/min -> 180 0C 6 0C/min -> 250 0C45C => 1C/min => 100C => 5C/min => 250C (10min)
I 1411.1409.1409.1409.1409.
ReferenceKannaste, Vongvanich, et al., 2008Kannaste, Vongvanich, et al., 2008Profitt, Schatz, et al., 2008Proffit, 2007Tognolini, Barocelli, et al., 2006
Comment MSDC-RI MSDC-RI MSDC-RI MSDC-RI MSDC-RI
Column type CapillaryCapillaryCapillaryCapillaryCapillary
Active phase DB-5SE-30CP Sil 8 CBDB-5Methyl Silicone
Column length (m) 30. 50.30.
Carrier gas He HeHe
Substrate
Column diameter (mm) 0.25 0.320.25
Phase thickness (μm) 0.25 0.250.25
Program 40C(1min) => 9C/min => 130C => 2C/min => 230Cnot specified60C(1min) => 5C/min => 160C => 10C/min => 250C(5min)60C => 3C/min => 240C => 30C/min => 300Cnot specified
I 1418.1422.1404.1395.1422.
ReferenceHamm, Bleton, et al., 2005Vinogradov, 2004Mockute, Nivinskiene, et al., 2003Yusuf, Begum, et al., 1998Zenkevich, 1996
Comment MSDC-RI MSDC-RI MSDC-RI MSDC-RI MSDC-RI
Column type Capillary
Active phase DB-5
Column length (m) 30.
Carrier gas
Substrate
Column diameter (mm) 0.25
Phase thickness (μm) 0.25
Program 35C(1min) => 5C/min => 230C => 20C/min => 280C
I 1406.
ReferenceJelen H.H., Mirocha C.J., et al., 1995
Comment MSDC-RI

Normal alkane RI, polar column, custom temperature program

Data compiled by: NIST Mass Spectrometry Data Center, William E. Wallace, director

Column type CapillaryCapillary
Active phase HP-Innowax FSCHP-Innowax FSC
Column length (m) 60.60.
Carrier gas HeHe
Substrate
Column diameter (mm) 0.250.25
Phase thickness (μm) 0.250.25
Program 60C(10min) => 4C/min => 220C(10min) => 1C/min => 240C60C (10min) => 4C/min => 220C (10min) => 1C/min => 240C
I 1589.1589.
ReferenceTabanca, Demirci, et al., 2005Demirci, Baser, et al., 2003
Comment MSDC-RI MSDC-RI

Normal alkane RI, non-polar column, temperature ramp

Data compiled by: NIST Mass Spectrometry Data Center, William E. Wallace, director

Column type CapillaryCapillaryCapillaryCapillaryCapillary
Active phase HP-5 MSDB-5DB-5DB-5HP-5 MS
Column length (m) 60.35.35.35.30.
Carrier gas HeliumHeliumHeliumHeliumHelium
Substrate
Column diameter (mm) 0.250.200.200.200.25
Phase thickness (μm) 0.250.100.100.100.25
Tstart (C) 40.50.50.50.50.
Tend (C) 250.200.200.200.180.
Heat rate (K/min) 3.4.4.4.2.
Initial hold (min) 1.
Final hold (min) 20.
I 1383.1404.1431.1431.1411.
ReferenceSardashti, Valizadeh, et al., 2013Silva, Suzuki, et al., 2012Silva, Suzuki, et al., 2012Silva, Suzuki, et al., 2012Hammami, Kamoun, et al., 2011
Comment MSDC-RI MSDC-RI MSDC-RI MSDC-RI MSDC-RI
Column type CapillaryCapillaryCapillaryCapillaryCapillary
Active phase HP-5HP-5DB-5MSHP-1BP-1
Column length (m) 30.30.30.30.50.
Carrier gas HeliumHeliumHeHe
Substrate
Column diameter (mm) 0.320.320.250.250.22
Phase thickness (μm) 0.250.250.250.250.25
Tstart (C) 60.100.60.60.60.
Tend (C) 240.240.240.240.220.
Heat rate (K/min) 3.5.3.2.2.
Initial hold (min) 2.2.
Final hold (min)  5. 20.20.
I 1407.1404.1405.1403.1406.
ReferenceKahriman, Tosun, et al., 2011Lago, Romoff, et al., 2008Andrade, Oliveira, et al., 2007Hachicha, Skanji, et al., 2007Boti, Yao, et al., 2006
Comment MSDC-RI MSDC-RI MSDC-RI MSDC-RI MSDC-RI
Column type CapillaryCapillaryCapillaryCapillaryCapillary
Active phase HP-5MSHP-5DB-5HP-5DB-5
Column length (m) 30.30.30.30.30.
Carrier gas HeHeliumHeHeHe
Substrate
Column diameter (mm) 0.250.320.250.250.25
Phase thickness (μm) 0.250.250.250.250.25
Tstart (C) 60.60.60.60.60.
Tend (C) 280.260.220.220.260.
Heat rate (K/min) 3.5.4.5.5.
Initial hold (min)  2. 10.
Final hold (min)  13.
I 1405.1408.1409.1404.1418.
ReferenceBozin, Mimicá-Dukic, et al., 2006Kucuk, Gulec, et al., 2006Morteza-Semnani, Akbarzadeh, et al., 2006Pintore G., Chessa M., et al., 2006Sabulal, Dan, et al., 2006
Comment MSDC-RI MSDC-RI MSDC-RI MSDC-RI MSDC-RI
Column type CapillaryCapillaryCapillaryCapillaryCapillary
Active phase DB-5SPB-5DB-5DB-5Methyl Silicone
Column length (m) 30.60.30.30.12.5
Carrier gas N2HeHeHeHe
Substrate
Column diameter (mm) 0.250.320.250.250.25
Phase thickness (μm) 0.251.0.250.250.25
Tstart (C) 60.40.60.60.50.
Tend (C) 240.230.300.230.270.
Heat rate (K/min) 4.3.3.3.4.
Initial hold (min)  5.3.
Final hold (min)
I 1410.1442.1402.1404.1412.
ReferenceTrilles, Bombarda, et al., 2006Cornu, Kondjoyan, et al., 2005Ferraz, Limberger, et al., 2005Limberger, Sobral, et al., 2005Ricci, Fraternale, et al., 2005
Comment MSDC-RI MSDC-RI MSDC-RI MSDC-RI MSDC-RI
Column type CapillaryCapillaryCapillaryCapillaryCapillary
Active phase CP Sil 5 CBCP Sil 5 CBHP-5MSHP-5MSBP-1
Column length (m) 30.30.30.30.50.
Carrier gas HeHeHeHe
Substrate
Column diameter (mm) 0.250.250.250.250.22
Phase thickness (μm) 0.250.250.250.250.25
Tstart (C) 40.40.60.60.60.
Tend (C) 220.220.280.280.220.
Heat rate (K/min) 4.4.4.3.2.
Initial hold (min) 1.1.
Final hold (min)     20.
I 1409.1409.1403.1405.1405.
ReferenceRohloff and Bones, 2005Rohloff and Bones, 2005Sajjadi S.E. and Eskandari B., 2005Slavkovska, Couladis, et al., 2005Blanc, Muselli, et al., 2004
Comment MSDC-RI MSDC-RI MSDC-RI MSDC-RI MSDC-RI
Column type CapillaryCapillaryCapillaryCapillaryCapillary
Active phase DB-5MSDB-5DB-5MSDB-1DB-5
Column length (m) 30.30.30.30.30.
Carrier gas HeHeHeN2He
Substrate
Column diameter (mm) 0.250.250.250.250.25
Phase thickness (μm) 0.250.250.250.250.25
Tstart (C) 60.60.60.50.60.
Tend (C) 240.300.280.200.280.
Heat rate (K/min) 3.3.3.5.3.
Initial hold (min)
Final hold (min)   30. 30.
I 1403.1404.1383.1401.1391.
Referencepaz Lima, Silva, et al., 2004Limberger, Sobral, et al., 2004Marongiu, Porcedda, et al., 2004Fekam Boyom, Ngouana, et al., 2003Marongiu, Porcedda, et al., 2003
Comment MSDC-RI MSDC-RI MSDC-RI MSDC-RI MSDC-RI
Column type CapillaryCapillaryCapillaryCapillaryCapillary
Active phase HP-5DB-5SPB-5DB-5MSBP-1
Column length (m) 30.30.60.30.25.
Carrier gas HeHeHeliumHeN2
Substrate
Column diameter (mm) 0.250.20.320.250.50
Phase thickness (μm) 0.250.251.0 0.25
Tstart (C) 60.75.30.50.60.
Tend (C) 280.220.230.280.220.
Heat rate (K/min) 3.3.3.15.5.
Initial hold (min)  4. 2.
Final hold (min)    10.10.
I 1387.1399.1439.1425.1395.
ReferencePitarokili, Tzakou, et al., 2003Priestap, van Baren, et al., 2003Sebastian, Viallon-Fernandez, et al., 2003Damon, Hernández, et al., 2002Das, Ram, et al., 2002
Comment MSDC-RI MSDC-RI MSDC-RI MSDC-RI MSDC-RI
Column type CapillaryCapillaryCapillaryCapillaryCapillary
Active phase BPX-5DB-5DB-1CP Sil 5 CBDB-5
Column length (m)  30.60.25.30.
Carrier gas  HeN2H2He
Substrate
Column diameter (mm)  0.250.2480.250.25
Phase thickness (μm)  0.250.250.150.25
Tstart (C) 40.60.60.50.65.
Tend (C) 260.250.220.320.300.
Heat rate (K/min) 5.3.3.3.4.
Initial hold (min)   5. 2.
Final hold (min)   22.
I 1409.1404.1395.1394.1413.
ReferenceDiaz and Kite, 2002Limberger, Simões-Pires, et al., 2002Bailac, Dellacasa, et al., 2001Asekun and Ekundayo, 1999Elias, Simoneit, et al., 1997
Comment MSDC-RI MSDC-RI MSDC-RI MSDC-RI MSDC-RI
Column type CapillaryCapillaryCapillary
Active phase SE-54SE-30+IgepalSE-30+Igepal
Column length (m) 30.100.100.
Carrier gas Hydrogen
Substrate
Column diameter (mm) 0.250.250.25
Phase thickness (μm) 0.25
Tstart (C) 60.70.70.
Tend (C) 250.170.170.
Heat rate (K/min) 2.1.1.
Initial hold (min) 5.
Final hold (min) 2.
I 1408.1426.1426.
ReferenceKollmannsberger, Nitz, et al., 1992Shibamoto and Jennings, 1977Shibamoto and Jennings, 1977
Comment MSDC-RI MSDC-RI MSDC-RI

Kovats' RI, non-polar column, temperature ramp

Data compiled by: NIST Mass Spectrometry Data Center, William E. Wallace, director

Column type CapillaryCapillaryCapillaryCapillaryCapillary
Active phase HP-5MSSPB-1DB-5CP Sil 5 CBSSP-1
Column length (m) 60.30.50.25.30.
Carrier gas HeHeHeHeHe
Substrate
Column diameter (mm) 0.250.320.320.250.32
Phase thickness (μm) 0.250.250.250.150.25
Tstart (C) 40.60.50.50.50.
Tend (C) 250.240.280.230.250.
Heat rate (K/min) 3.4.5.3.2.
Initial hold (min) 1.4.2. 2.
Final hold (min) 20.2.10. 5.
I 1428.1434.1407.1411.1427.
ReferenceJalali-Heravi, Zekavat, et al., 2006Walde, Jyothirmayi, et al., 2006Baranauskiene, Venskutonis, et al., 2003Ogunwande, Olawore, et al., 2003Nagarajan, Rao, et al., 2001
Comment MSDC-RI MSDC-RI MSDC-RI MSDC-RI MSDC-RI
Column type Capillary
Active phase HP-5MS
Column length (m) 30.
Carrier gas He
Substrate
Column diameter (mm) 0.25
Phase thickness (μm) 0.25
Tstart (C) 60.
Tend (C) 280.
Heat rate (K/min) 3.
Initial hold (min)
Final hold (min)
I 1404.
ReferenceRoussis, Tsoukatou, et al., 2000
Comment MSDC-RI

References

VOC BinBase, 2012
VOC BinBase, The volatile compound BinBase (VOC BinBase), 2012, retrieved from http://fiehnlab.ucdavis.edu/projects/VocBinBase and http://binbase.sourceforge.net. [all data]

Kahriman, Tosun, et al., 2011
Kahriman, N.; Tosun, G.; Terzioglu, S.; Karaoglu, S.A.; Yayh, N., Chemical composition and antimicrobial activity of the essential oils from the flower, leaf, and stem of Senecio pandurifolis, Rec. Nat. Prod., 2011, 5, 2, 82-91. [all data]

Nance and Setzer, 2011
Nance, M.R.; Setzer, W.N., Volatile components of aroma hops (Humulus lupulus L.) commonly used in beer brewing, J. of Brewing and Distilling, 2011, 2, 2, 16-22. [all data]

Skogerson, Wohlgemuth, et al., 2011
Skogerson, K.; Wohlgemuth, G.; Fiehn, O., VocBinNase, 2011, retrieved from http://fiehnlab.ucdavis.edu/projects//VocBinBase. [all data]

Courtois, Paine, et al., 2009
Courtois, E.A.; Paine, C.E.; Blandinieres, P.-A.; Stien, D.; Bessiere, J.-M.; Houel, E.; Baraloto, C.; Chave, J., Diversity of the volatile organic compounds emitted by 55 species of tropical trees: a survey in French Guiana, J. Chem. Ecol., 2009, 35, 11, 1349-1362, https://doi.org/10.1007/s10886-009-9718-1 . [all data]

Kannaste, Vongvanich, et al., 2008
Kannaste, A.; Vongvanich, N.; Borg-Karlson, A.-K., Infestation by a Nalepella species induces emissions of alpha- and beta-farnesenes, (-)-linalool and aromatic compounds in Norway spruce clones of different susceptibility to the large pine weevil, Anthropod-Plant Interactions, 2008, 2, 1, 31-41, https://doi.org/10.1007/s11829-008-9029-4 . [all data]

Profitt, Schatz, et al., 2008
Profitt, M.; Schatz, B.; Bessiere, J.-M.; Chen, C.; Soler, C.; Hossaert-McKey, M., Signalling receptivity: comparison of the emission of volatile compounds by figs of Ficus hispida before, during and after the phase of receptivity to pollinators, Symbiosis, 2008, 45, 1-10. [all data]

Proffit, 2007
Proffit, M., Mediation chimique et structuration des communautes d'hymenopteres parasites du mutualisme figuier / pollinisateur (These pour obtenir le grade de Docteur de l'Universite Montpellier II) (Dissertation), 2007. [all data]

Tognolini, Barocelli, et al., 2006
Tognolini, M.; Barocelli, E.; Ballabeni, V.; Bruni, R.; Bianchi, A.; Chiavarini, M.; Impicciatore, M., Comparative screening of plant essential oils: Phenylpropanoid moiety as basic core for antiplatelet activity, Life Sciences, 2006, 78, 13, 1419-1432, https://doi.org/10.1016/j.lfs.2005.07.020 . [all data]

Hamm, Bleton, et al., 2005
Hamm, S.; Bleton, J.; Connan, J.; Tchapla, A., A chemical investigation by headspace SPME and GC-MS of volatile and semi-volatile terpenes in various olibanum samples, Phytochemistry, 2005, 66, 12, 1499-1514, https://doi.org/10.1016/j.phytochem.2005.04.025 . [all data]

Vinogradov, 2004
Vinogradov, B.A., Production, composition, properties and application of essential oils, 2004, retrieved from http://viness.narod.ru. [all data]

Mockute, Nivinskiene, et al., 2003
Mockute, D.; Nivinskiene, O.; Bernotiene, G.; Butkiene, R., The cis-thujone chemotype of Salvia officinalis L. essential oils, Chemija, 2003, 14, 4, 216-220. [all data]

Yusuf, Begum, et al., 1998
Yusuf, M.; Begum, J.; Mondello, L.; Stagno d'Alcontres, I.S., Studies on the essential oil bearing plants of Bangladesh. Part VI. Composition of the oil of Ocimum gratissimum L., Flavour Fragr. J., 1998, 13, 3, 163-166, https://doi.org/10.1002/(SICI)1099-1026(199805/06)13:3<163::AID-FFJ714>3.0.CO;2-1 . [all data]

Zenkevich, 1996
Zenkevich, I.G., Analytical Parameters of Components of Essential Oils for their Chromatographic and Chromato-Mass Spectral Identification. Mono- and Sesquiterpenes, Rastitelnye Resursy (Plant resources), 1996, 34, 1-2, 48-58. [all data]

Jelen H.H., Mirocha C.J., et al., 1995
Jelen H.H.; Mirocha C.J.; Wasowicz E.; Kaminski E., Production of volatile sesquiterpenes by Fusarium sambucinum strans with different abilities to synthesize trichlothecenes, Appl. Environ. Microbiol., 1995, 61, 11, 3815-3820. [all data]