2,5-Di-n-octyloxy-1,4-benzoquinone

Phase change data

Data compiled by: William E. Acree, Jr., James S. Chickos

Enthalpy of fusion

ΔfusH (kcal/mol) Temperature (K) Method Reference
10.3405.8DSCKeegstra, van der Mieden, et al., 1996

References

Keegstra, van der Mieden, et al., 1996
Keegstra, Erik M.D.; van der Mieden, Valentijn; Zwikker, Jan W.; Jenneskens, Leonardus W.; Schouten, Arie; Kooijman, Huub; Veldman, Nora; Spek, Anthony L., Self-Organization of 2,5-Di- n -Alkoxy-1,4-benzoquinones in the Solid State: Molecular Recognition Involving Intermolecular Dipole-Dipole, Weak C-H···OC Hydrogen Bond and van der Waals Interactions, Chem. Mater., 1996, 8, 5, 1092-1105, https://doi.org/10.1021/cm950526w . [all data]