dimethylaluminium chloride

Phase change data

Data compiled by: José A. Martinho Simões

Quantity Value Units Method Reference Comment
Δvap9.73kcal/molN/AUfnalski and Sporzynski, 1983

References

Ufnalski and Sporzynski, 1983
Ufnalski, W.; Sporzynski, A., J. Organometal. Chem., 1983, 244, 1. [all data]