(3β)-cholest-5-en-3-yl octadecanoate

Phase change data

Data compiled by: Thermodynamics Research Center, NIST Boulder Laboratories, Chris Muzny director

Quantity Value Units Method Reference Comment
Tfus355.4KN/AKishimoto, Iwasaki, et al., 1986Uncertainty assigned by TRC = 0.5 K
Tfus355.KN/ADavis, Porter, et al., 1970Uncertainty assigned by TRC = 0.5 K
Tfus358.KN/ABarrall, Porter, et al., 1967Uncertainty assigned by TRC = 0.5 K

In addition to the Thermodynamics Research Center (TRC) data available from this site, much more physical and chemical property data is available from the following TRC products:

References

Kishimoto, Iwasaki, et al., 1986
Kishimoto, H.; Iwasaki, T.; Yonese, M., Thermodynamic and viscometric studies on the thermotropic phase-stability of cholesteryl myristate, palmitate, stearate, and oleate, Chem. Pharm. Bull., 1986, 34, 2698-2709. [all data]

Davis, Porter, et al., 1970
Davis, G.J.; Porter, R.S.; Barrall, E.M., Evaluation of Thermal Transitions in Some Cholesteryl Esters of Saturated Aliphatic Acids, Mol. Cryst. Liq. Cryst., 1970, 10, 1-2, 1, https://doi.org/10.1080/15421407008083482 . [all data]

Barrall, Porter, et al., 1967
Barrall, E.M.; Porter, R.S.; Johnson, J.F., Heats of transition for some cholesteryl esters by differential scanning calorimetry., J. Phys. Chem., 1967, 71, 1224. [all data]