COBeO

Vibrational and/or electronic energy levels

Data compiled by: Marilyn E. Jacox

State:   X

Vib.
sym.
 No.   Approximate
 type of mode
 cm-1   Med.   Method   References

CO stretch 2056.5 Ar IR Andrews and Tague, 1994
BeO stretch 1533.9 Ar IR Andrews and Tague, 1994

Additional references: Jacox, 1998, page 248

References

Andrews and Tague, 1994
Andrews, L.; Tague, T.J., Jr., Reactions of Pulsed-Laser-Evaporated Be Atoms with CO2. Infrared Spectra of OCBeO and COBeO in Solid Argon, J. Am. Chem. Soc., 1994, 116, 15, 6856, https://doi.org/10.1021/ja00094a045 . [all data]

Jacox, 1998
Jacox, M.E., Vibrational and electronic energy levels of polyatomic transient molecules: supplement A, J. Phys. Chem. Ref. Data, 1998, 27, 2, 115-393, https://doi.org/10.1063/1.556017 . [all data]