2,4-dinitrosoresorcinol

Condensed phase thermochemistry data

Data compiled by: Hussein Y. Afeefy, Joel F. Liebman, and Stephen E. Stein

Quantity Value Units Method Reference Comment
Δcsolid-2698.kJ/molCcbSwientoslawski, 1910

References

Swientoslawski, 1910
Swientoslawski, W., Thermochemische Untersuchungen der organischen Verbindungen. Dritte Mitteilung. Stickstoffhaltige Verbindungen., Z. Phys. Chem., 1910, 72, 49-83. [all data]

Edwards and Tate, 1951
Edwards, W.R., Jr.; Tate, C.W., Anal. Chem., 1951, 23, 826. [all data]