CH3NS

Reaction thermochemistry data

Data compiled by: John E. Bartmess

Individual Reactions

CH2NS- + Hydrogen cation = CH3NS

By formula: CH2NS- + H+ = CH3NS

Quantity Value Units Method Reference Comment
Δr350.0 ± 3.7kcal/molG+TSKass and DePuy, 1985gas phase; value altered from reference due to change in acidity scale
Quantity Value Units Method Reference Comment
Δr343.2 ± 3.6kcal/molIMRBKass and DePuy, 1985gas phase; value altered from reference due to change in acidity scale

Gas phase ion energetics data

Data compiled by: John E. Bartmess

De-protonation reactions

CH2NS- + Hydrogen cation = CH3NS

By formula: CH2NS- + H+ = CH3NS

Quantity Value Units Method Reference Comment
Δr350.0 ± 3.7kcal/molG+TSKass and DePuy, 1985gas phase; value altered from reference due to change in acidity scale
Quantity Value Units Method Reference Comment
Δr343.2 ± 3.6kcal/molIMRBKass and DePuy, 1985gas phase; value altered from reference due to change in acidity scale

References

Kass and DePuy, 1985
Kass, S.R.; DePuy, C.H., Gas phase ion chemistry of azides. The generation of CH=N- and CH2=NCH2-, J. Org. Chem., 1985, 50, 2874. [all data]