CAS Reg. No. 117951-43-6

Reaction thermochemistry data

Data compiled by: John E. Bartmess

Individual Reactions

(CAS Reg. No. 117951-43-6 • 42949672952-Pentanone) + 2-Pentanone = CAS Reg. No. 117951-43-6

By formula: (CAS Reg. No. 117951-43-6 • 4294967295C5H10O) + C5H10O = CAS Reg. No. 117951-43-6

Quantity Value Units Method Reference Comment
Δr40.0 ± 2.1kcal/molN/AHaas and Harrison, 1993gas phase; Both metastable and 50 eV collision energy.

References

Haas and Harrison, 1993
Haas, M.J.; Harrison, A.G., The Fragmentation of Proton-Bound Cluster Ions and the Gas-Phase Acidities of Alcohols, Int. J. Mass Spectrom. Ion Proc., 1993, 124, 2, 115, https://doi.org/10.1016/0168-1176(93)80003-W . [all data]