C23H30O

Reaction thermochemistry data

Data compiled by: John E. Bartmess

Individual Reactions

C23H29O- + Hydrogen cation = C23H30O

By formula: C23H29O- + H+ = C23H30O

Quantity Value Units Method Reference Comment
Δr1450. ± 10.kJ/molG+TSMishima, Mustanir, et al., 2000gas phase; Keto acidity; enol acidity=337.2: 323 K
Quantity Value Units Method Reference Comment
Δr1420. ± 8.4kJ/molIMREMishima, Mustanir, et al., 2000gas phase; Keto acidity; enol acidity=337.2: 323 K

Gas phase ion energetics data

Data compiled by: John E. Bartmess

De-protonation reactions

C23H29O- + Hydrogen cation = C23H30O

By formula: C23H29O- + H+ = C23H30O

Quantity Value Units Method Reference Comment
Δr346.6 ± 2.5kcal/molG+TSMishima, Mustanir, et al., 2000gas phase; Keto acidity; enol acidity=337.2: 323 K
Quantity Value Units Method Reference Comment
Δr339.5 ± 2.0kcal/molIMREMishima, Mustanir, et al., 2000gas phase; Keto acidity; enol acidity=337.2: 323 K

References

Mishima, Mustanir, et al., 2000
Mishima, M.; Mustanir; Eventova, I.; Rappoport, Z., Acidities and pK(Enol) values of stable simple enols in the gas phase, J. Chem. Soc. Perkin Trans., 2000, 2, 7, 1505-1512, https://doi.org/10.1039/b001155j . [all data]