Di-n-octyl phthalate

Condensed phase thermochemistry data

Data compiled as indicated in comments:
ALS - Hussein Y. Afeefy, Joel F. Liebman, and Stephen E. Stein
DH - Eugene S. Domalski and Elizabeth D. Hearing

Quantity Value Units Method Reference Comment
Δcliquid-13839.kJ/molCcbHandrick, 1956Naval Powder Factory, 1952; Corresponding Δfliquid = -1036. kJ/mol (simple calculation by NIST; no Washburn corrections); ALS
Quantity Value Units Method Reference Comment
solid,1 bar755.2J/mol*KN/AMartynenko, Rabinovich, et al., 1970DH

Constant pressure heat capacity of solid

Cp,solid (J/mol*K) Temperature (K) Reference Comment
707.1300.Martynenko, Rabinovich, et al., 1970T = 60 to 360 K.; DH

Phase change data

Data compiled as indicated in comments:
TRC - Thermodynamics Research Center, NIST Boulder Laboratories, Chris Muzny director
AC - William E. Acree, Jr., James S. Chickos

Quantity Value Units Method Reference Comment
Tboil659.KN/ASeliverstov, 1970Uncertainty assigned by TRC = 5. K; TRC

Enthalpy of vaporization

ΔvapH (kJ/mol) Temperature (K) Method Reference Comment
99.5438.AStephenson and Malanowski, 1987Based on data from 423. - 523. K.; AC
107.6398.TPerry and Weber, 1949Based on data from 383. - 433. K.; AC

In addition to the Thermodynamics Research Center (TRC) data available from this site, much more physical and chemical property data is available from the following TRC products:

Kovats' RI, non-polar column, isothermal

View large format table.

Column type Active phase Temperature (C) I Reference Comment
CapillaryOV-101230.2682.Friocourt, Berthou, et al., 197950. m/0.3 mm/0.35 μm, H2
CapillarySE-30250.2685.Friocourt, Berthou, et al., 197942. m/0.3 mm/0.39 μm, He

Kovats' RI, non-polar column, temperature ramp

View large format table.

Column type Active phase I Reference Comment
PackedOV-1012687.Alley and Dykes, 19726. K/min; Tstart: 70. C; Tend: 220. C

Van Den Dool and Kratz RI, non-polar column, temperature ramp

View large format table.

Column type Active phase I Reference Comment
CapillaryVF-5MS2741.Liang, 201030. m/0.25 mm/0.25 μm, He; Tstart: 60. C; Tend: 270. C

Normal alkane RI, non-polar column, temperature ramp

View large format table.

Column type Active phase I Reference Comment
CapillaryUltra-12686.Okumura, 199125. m/0.32 mm/0.25 μm, He, 3. K/min; Tstart: 80. C; Tend: 260. C

Lee's RI, non-polar column, temperature ramp

View large format table.

Column type Active phase I Reference Comment
CapillaryDB-5420.4Donnelly, Abdel-Hamid, et al., 199330. m/0.32 mm/0.25 μm, He, 40. C @ 3. min, 8. K/min, 285. C @ 29.5 min
CapillaryDB-5416.1Viau, Studak, et al., 1984Helium, 4. K/min; Column length: 30. m; Column diameter: 0.32 mm; Tstart: 90. C; Tend: 250. C

References

Handrick, 1956
Handrick, G.R., Report of the study of pure explosive compounds. Part IV. Calculation of heat of combustion of organic compounds from structural features and calculation of power of high explosives, Rpt. C-58247 for the Office of the Chief of Ordnance, contract DA-19-020-ORD-47 by the Arthur D. Little, Inc., Cambridge, MA, 1956, 467-573. [all data]

Martynenko, Rabinovich, et al., 1970
Martynenko, L.Ya.; Rabinovich, I.B.; Ovchinnikov, Yu.V.; Maslova, V.A., Heat capacity of the systems polyvinyl chloride-dioctylphthalate and polyvinyl chloride-dibutylphthalate, Polymer Sci., 1970, USSR 12A, 952-961. [all data]

Seliverstov, 1970
Seliverstov, V.M., Solubility of difluoromonochloromethane in certain phthalates, dioctyl sebacate, triacetin, and dimethylformamide, Zh. Prikl. Khim. (Leningrad), 1970, 43, 1605-7. [all data]

Stephenson and Malanowski, 1987
Stephenson, Richard M.; Malanowski, Stanislaw, Handbook of the Thermodynamics of Organic Compounds, 1987, https://doi.org/10.1007/978-94-009-3173-2 . [all data]

Perry and Weber, 1949
Perry, E.S.; Weber, W.H., Vapor Pressures of Phlegmatic Liquids. II. High Molecular Weight Esters and Silicone Oils, J. Am. Chem. Soc., 1949, 71, 11, 3726-3730, https://doi.org/10.1021/ja01179a039 . [all data]

Friocourt, Berthou, et al., 1979
Friocourt, M.P.; Berthou, F.; Picart, D.; Dreano, Y.; Floch, H.H., Glass Capillary Column Gas Chromatography of Phthalate Esters, J. Chromatogr., 1979, 172, 1, 261-271, https://doi.org/10.1016/S0021-9673(00)90961-0 . [all data]

Alley and Dykes, 1972
Alley, B.J.; Dykes, H.W.H., Gas-Liquid Chromatographic Determination of Nitrate Esters,Stabilizers and Plasticizers in Nitrocellulose-Base Propellants, J. Chromatogr., 1972, 71, 1, 23-37, https://doi.org/10.1016/S0021-9673(01)85687-9 . [all data]

Liang, 2010
Liang, Y., Retention Data. NIST Mass Spectrometry Data Center., NIST Mass Spectrometry Data Center, 2010. [all data]

Okumura, 1991
Okumura, T., retention indices of environmental chemicals on methyl silicone capillary column, Journal of Environmental Chemistry (Japan), 1991, 1, 2, 333-358, https://doi.org/10.5985/jec.1.333 . [all data]

Donnelly, Abdel-Hamid, et al., 1993
Donnelly, J.R.; Abdel-Hamid, M.S.; Jeter, J.L.; Gurka, D.F., Application of gas chromatographic retention properties to the identification of environmental contaminants, J. Chromatogr., 1993, 642, 1-2, 409-415, https://doi.org/10.1016/0021-9673(93)80106-I . [all data]

Viau, Studak, et al., 1984
Viau, A.C.; Studak, S.M.; Karasek, F.W., Comparative analysis of hazardous compounds on flu-ash from municipal waste incineration by gas chromatography / mass spectrometry, Can. J. Chem., 1984, 62, 11, 2140-2145, https://doi.org/10.1139/v84-366 . [all data]