Bis(2-methoxyethyl) phthalate

Normal alkane RI, non-polar column, temperature ramp

Data compiled by: NIST Mass Spectrometry Data Center, William E. Wallace, director

Column type PackedPackedPackedPackedPacked
Active phase SE-30SE-30SE-30SE-30SE-30
Column length (m) 2.2.2.2.2.
Carrier gas NitrogenNitrogenNitrogenNitrogenNitrogen
Substrate Chromosorb Q (60-80 mesh)Chromosorb Q (60-80 mesh)Chromosorb Q (60-80 mesh)Chromosorb Q (60-80 mesh)Chromosorb Q (60-80 mesh)
Column diameter (mm)
Phase thickness (μm)
Tstart (C) 100.100.100.100.100.
Tend (C) 290.290.290.290.290.
Heat rate (K/min) 8.8.8.8.8.
Initial hold (min)
Final hold (min)
I 1950.1950.1951.1951.1952.
ReferenceLourici, Souici, et al., 1999Lourici, Souici, et al., 1999Lourici, Souici, et al., 1999Lourici, Souici, et al., 1999Lourici, Souici, et al., 1999
Comment MSDC-RI MSDC-RI MSDC-RI MSDC-RI MSDC-RI
Column type PackedPacked
Active phase SE-30SE-30
Column length (m) 2.2.
Carrier gas NitrogenNitrogen
Substrate Chromosorb Q (60-80 mesh)Chromosorb Q (60-80 mesh)
Column diameter (mm)
Phase thickness (μm)
Tstart (C) 100.100.
Tend (C) 290.290.
Heat rate (K/min) 8.8.
Initial hold (min)
Final hold (min)
I 1952.1962.
ReferenceLourici, Souici, et al., 1999Lourici, Souici, et al., 1999
Comment MSDC-RI MSDC-RI

Kovats' RI, non-polar column, temperature ramp

Data compiled by: NIST Mass Spectrometry Data Center, William E. Wallace, director

Column type CapillaryCapillary
Active phase DB-5DB-5
Column length (m) 30.30.
Carrier gas HeHe
Substrate
Column diameter (mm) 0.130.13
Phase thickness (μm)
Tstart (C) 30.30.
Tend (C) 280.280.
Heat rate (K/min) 10.10.
Initial hold (min) 2.2.
Final hold (min) 3.3.
I 1986.1985.
ReferenceRamarathnam, Rubin, et al., 1993Ramarathnam, Rubin, et al., 1993, 2
Comment MSDC-RI MSDC-RI

References

Lourici, Souici, et al., 1999
Lourici, L.; Souici, M.-L.; Rebbani, N.; Messadi, D., Independent of local properties mathematical models for the calculation of retention indices in programmed temperature gas chromatography, Analusis, 1999, 27, 3, 249-254, https://doi.org/10.1051/analusis:1999114 . [all data]