Anthraquinone, 2-amino-

Phase change data

Data compiled by: Thermodynamics Research Center, NIST Boulder Laboratories, Chris Muzny director

Quantity Value Units Method Reference Comment
Tfus524.KN/ABaughman and Perenich, 1988Uncertainty assigned by TRC = 1. K

In addition to the Thermodynamics Research Center (TRC) data available from this site, much more physical and chemical property data is available from the following TRC products:

Lee's RI, non-polar column, custom temperature program

View large format table.

Column type Active phase I Reference Comment
CapillaryDB-5406.Eckel, 2000Program: not specified
CapillaryDB-5406.03Eckel, 2000Program: not specified
CapillaryDB-5407.06Eckel, 2000Program: not specified
CapillaryDB-5408.Eckel, 2000Program: not specified

References

Baughman and Perenich, 1988
Baughman, G.L.; Perenich, T.A., Fate of dyes in aquatic systems: I. Solubility and partitioning of some hydrophobic dyes and related compounds, Environ. Tox. Chem., 1988, 7, 3, 183, https://doi.org/10.1002/etc.5620070302 . [all data]

Hartmann and Lorenz, 1952
Hartmann, H.; Lorenz, E., Z. Naturforsh, 1952, 7a, 360. [all data]

Eckel, 2000
Eckel, W.P., Making sense of nontarget compound data from GC-MS library searches, Am. Lab. Fairfield Conn., 2000, 17-20. [all data]