2-((2S,4aR)-4a,8-Dimethyl-1,2,3,4,4a,5,6,7-octahydronaphthalen-2-yl)propan-2-ol

Normal alkane RI, non-polar column, temperature ramp

Data compiled by: NIST Mass Spectrometry Data Center, William E. Wallace, director

Column type Capillary
Active phase HP-5
Column length (m) 30.
Carrier gas Helium
Substrate
Column diameter (mm) 0.25
Phase thickness (μm) 0.25
Tstart (C) 50.
Tend (C) 300.
Heat rate (K/min) 50.
Initial hold (min) 5.
Final hold (min) 5.
I 1660.
ReferenceBi Kouame, Bedi, et al., 2010
Comment MSDC-RI

References

Bi Kouame, Bedi, et al., 2010
Bi Kouame, F.P.; Bedi, G.; Koffi, A.M.; Chalchat, J.C.; Guessan, T.Y.N., Volatile constituents from leaves of Morinda morindoides (Rubiaceae): a medicinal plant from the Ivory Coast, The Open Nat. Prod. J., 2010, 3, 1, 6-9, https://doi.org/10.2174/1874848101003010006 . [all data]