F9Mo2

Reaction thermochemistry data

Data compiled by: John E. Bartmess

Individual Reactions

Fluorine anion + F9Mo2 = (Fluorine anion • F9Mo2)

By formula: F- + F9Mo2 = (F- • F9Mo2)

Quantity Value Units Method Reference Comment
Δr402. ± 36.kJ/molTDEqBorshchevskii, Boltalina, et al., 1988gas phase; value altered from reference due to conversion from electron convention to ion convention

Ion clustering data

Data compiled by: John E. Bartmess

Clustering reactions

Fluorine anion + F9Mo2 = (Fluorine anion • F9Mo2)

By formula: F- + F9Mo2 = (F- • F9Mo2)

Quantity Value Units Method Reference Comment
Δr402. ± 36.kJ/molTDEqBorshchevskii, Boltalina, et al., 1988gas phase; value altered from reference due to conversion from electron convention to ion convention

References

Borshchevskii, Boltalina, et al., 1988
Borshchevskii, A.Ya.; Boltalina, O.V.; Sorokin, I.D.; Sidorov, L.N., Thermochemical Quantities for Gas Phase Iron, Uranium, and Molybdenum Fluorides, and Their Negative Ions., J. Chem. Thermodyn., 1988, 20, 5, 523, https://doi.org/10.1016/0021-9614(88)90080-8 . [all data]