Al3O5 radical

Gas phase ion energetics data

Data compiled by: John E. Bartmess

Electron affinity determinations

EA (eV) Method Reference Comment
4.920 ± 0.080LPESWu, Li, et al., 1998Vertical Detachment Energy: 5.21±0.08 eV.

References

Wu, Li, et al., 1998
Wu, H.; Li, X.; Wang, X.-B.; Ding, C.-F.; Wang, L.-S., Al3Oy (y=0-5) Clusters: Sequential Oxidation, Metal-to-oxide Transformation, and Photoisomerization., J. Chem. Phys., 1998, 109, 2, 449, https://doi.org/10.1063/1.476583 . [all data]