violanthrene-5,10-dione

Phase change data

Data compiled by: William E. Acree, Jr., James S. Chickos

Enthalpy of sublimation

ΔsubH (kJ/mol) Temperature (K) Method Reference Comment
208.8528.AStephenson and Malanowski, 1987Based on data from 513. - 548. K.
202.9542.MEInokuchi, 1951

References

Stephenson and Malanowski, 1987
Stephenson, Richard M.; Malanowski, Stanislaw, Handbook of the Thermodynamics of Organic Compounds, 1987, https://doi.org/10.1007/978-94-009-3173-2 . [all data]

Inokuchi, 1951
Inokuchi, H., J. Chem. Soc. Jpn. Pure Chem. Sect., 1951, 72, 552. [all data]