Fe28 radical
- Formula: Fe28
- Molecular weight: 1563.660
- CAS Registry Number: 116326-97-7

Gas phase ion energetics data

Data compiled by: John E. Bartmess
Electron affinity determinations
EA (eV) | Method | Reference | Comment |
---|---|---|---|
2.250 ± 0.060 | LPES | Wang, Li, et al., 2000 |

References

Wang, Li, et al., 2000
Wang, L.S.; Li, X.; Zhang, H.F.,
Probing the electronic structure of iron clusters using photoelectron spectroscopy,
Chem. Phys., 2000, 262, 1, 53-63, https://doi.org/10.1016/S0301-0104(00)00351-7
. [all data]