Fe27 radical

Gas phase ion energetics data

Data compiled by: John E. Bartmess

Electron affinity determinations

EA (eV) Method Reference Comment
2.240 ± 0.060LPESWang, Li, et al., 2000

References

Wang, Li, et al., 2000
Wang, L.S.; Li, X.; Zhang, H.F., Probing the electronic structure of iron clusters using photoelectron spectroscopy, Chem. Phys., 2000, 262, 1, 53-63, https://doi.org/10.1016/S0301-0104(00)00351-7 . [all data]