CaN3

Vibrational and/or electronic energy levels

Data compiled by: Marilyn E. Jacox

State:   B

 Energy
 (cm-1
 Med.   Transition   λmin
 (nm)
 λmax
 (nm)

References

To = 17079 gas B-X 570 590 Brazier and Bernath, 1988

Vib.
sym.
 No.   Approximate
 type of mode
 cm-1   Med.   Method   References

Σ+ 3 CaN stretch 384 gas LF Brazier and Bernath, 1988
Π 5 CaNN bend 42.5 H gas LF Brazier and Bernath, 1988

State:   A

 Energy
 (cm-1
 Med.   Transition   λmin
 (nm)
 λmax
 (nm)

To = 16255 gas A-X 600 710 Brazier and Bernath, 1988

Vib.
sym.
 No.   Approximate
 type of mode
 cm-1   Med.   Method   References

Σ+ 3 CaN stretch 389 gas LF Brazier and Bernath, 1988

State:   X

Vib.
sym.
 No.   Approximate
 type of mode
 cm-1   Med.   Method   References

Σ+ 1 N3 a-stretch 2114 gas LF Brazier and Bernath, 1988
2 N3 s-stretch 1364 gas LF Brazier and Bernath, 1988
3 CaN stretch 396 gas LF Brazier and Bernath, 1988
Π 5 CaNN bend 43 H gas LF Brazier and Bernath, 1988

Additional references: Jacox, 1994, page 182

Brazier and Bernath, 1988
Brazier, C.R.; Bernath, P.F., Laser spectroscopy of calcium and strontium monoazide free radicals, J. Chem. Phys., 1988, 88, 4, 2112, https://doi.org/10.1063/1.454093 . [all data]

Jacox, 1994
Jacox, M.E., Vibrational and electronic energy levels of polyatomic transient molecules, American Chemical Society, Washington, DC, 1994, 464. [all data]