YC7 radical

Gas phase ion energetics data

Data compiled by: John E. Bartmess

Electron affinity determinations

EA (eV) Method Reference Comment
2.91 ± 0.10LPESKohno, Suzuki, et al., 2000Stated electron affinity is the Vertical Detachment Energy

References

Kohno, Suzuki, et al., 2000
Kohno, M.; Suzuki, S.; Shiromaru, H.; Kobayashi, K.; Nagase, S.; Achiba, Y.; Kietzmann, H.; Kessler, B.; Gante, Photoelectron spectroscopy study of MCn- (M=Sc, Y, and La, 5 = n = 20), J. Electron Spectros. Rel. Phenom., 2000, 112, 1-3, 163-173, https://doi.org/10.1016/S0368-2048(00)00210-3 . [all data]