Potassium undecamer, positive ion

Reaction thermochemistry data

Data compiled by: Michael M. Meot-Ner (Mautner) and Sharon G. Lias

Individual Reactions

K11+ + Dipotassium = (K11+ • Dipotassium)

By formula: K11+ + K2 = (K11+ • K2)

Quantity Value Units Method Reference Comment
Δr15.7kcal/molPDissBrechignac, Cahuzac, et al., 1990gas phase

References

Brechignac, Cahuzac, et al., 1990
Brechignac, C.; Cahuzac, P.; Carlier, F.; De Frutos, M.; Leyniger, J., Cohesive Energies of (K)n+ 5<n<200 from Photoevaporation Experiments, J. Chem. Phys., 1990, 93, 10, 7449, https://doi.org/10.1063/1.459418 . [all data]