2-Amino-2-ethyl-1,3-propanediol

Phase change data

Data compiled by: Robert L. Brown and Stephen E. Stein

Quantity Value Units Method Reference Comment
Tfus308. - 310.KN/ABuckingham and Donaghy, 1982

Reduced pressure boiling point

Tboil (K) Pressure (bar) Reference
425.0.013American Tokyo Kasei, 1988
419.0.01Buckingham and Donaghy, 1982

References

Buckingham and Donaghy, 1982
Buckingham, J.; Donaghy, S.M., Dictionary of Organic Compounds: Fifth Edition, Chapman and Hall, New York, 1982, 1. [all data]

American Tokyo Kasei, 1988
American Tokyo Kasei, TCI American Organic Chemical 88/89 Catalog, American Tokyo Kasei, Portland, OR, 1988, 1610. [all data]