1,4-bis((pyridine-3-ylimo)methyl)benzene

Phase change data

Data compiled by: William E. Acree, Jr., James S. Chickos

Enthalpy of fusion

ΔfusH (kJ/mol) Temperature (K) Method Reference
40.7438.2DSCStilinovic, Cincic, et al., 2008

References

Stilinovic, Cincic, et al., 2008
Stilinovic, V.; Cincic, D.; Kaitner, B., Acta Chim. Slov., 2008, 55, 4, 874. [all data]