C10

Vibrational and/or electronic energy levels

Data compiled by: Marilyn E. Jacox

State:   2 3Su-

 Energy
 (cm-1
 Med.   Transition   λmin
 (nm)
 λmax
 (nm)

References

To = 29985 ± 18 Ne 324 334 Grutter, Wyss, et al., 1999

Vib.
sym.
 No.   Approximate
 type of mode
 cm-1   Med.   Method   References

Σg+ 5 401 ± 25 Ne AB Grutter, Wyss, et al., 1999

State:   ?

 Energy
 (cm-1
 Med.   Transition   λmin
 (nm)
 λmax
 (nm)

To = 27925 ± 16 Ne 349 358 Grutter, Wyss, et al., 1999

Vib.
sym.
 No.   Approximate
 type of mode
 cm-1   Med.   Method   References

Σg+ 5 364 ± 22 Ne AB Grutter, Wyss, et al., 1999

State:   X

Vib.
sym.
 No.   Approximate
 type of mode
 cm-1   Med.   Method   References

Σu+ 2074.41 gas DL Giesen, Berndt, et al., 2001
2074.5 Ne IR Freivogel, Grutter, et al., 1997
1915.4 Ne IR Freivogel, Grutter, et al., 1997

Additional references: Jacox, 1998, page 353; Jacox, 2003, page 377

Grutter, Wyss, et al., 1999
Grutter, M.; Wyss, M.; Riaplov, E.; Maier, J.P.; Peyerimhoff, S.D.; Hanrath, M., Electronic absorption spectra of linear C[sub 6], C[sub 8] and cyclic C[sub 10], C[sub 12] in neon matrices, J. Chem. Phys., 1999, 111, 16, 7397, https://doi.org/10.1063/1.480062 . [all data]

Giesen, Berndt, et al., 2001
Giesen, T.F.; Berndt, U.; Yamada, K.M.T.; Fuchs, G.; Schieder, R.; Winnewisser, G., et al., Detection of the Linear Carbon Cluster C10: Rotationally Resolved Diode-Laser Spectroscopy, Chem. Phys. Chem., 2001, 2, 4, 242, https://doi.org/10.1002/1439-7641(20010417)2:4<242::AID-CPHC242>3.0.CO;2-# . [all data]

Freivogel, Grutter, et al., 1997
Freivogel, P.; Grutter, M.; Forney, D.; Maier, J.P., Infrared bands of mass-selected carbon chains Cn (n = 8-12) and Cn- (n = 5-10, 12) in neon matrices, Chem. Phys., 1997, 216, 3, 401, https://doi.org/10.1016/S0301-0104(97)00038-4 . [all data]

Jacox, 1998
Jacox, M.E., Vibrational and electronic energy levels of polyatomic transient molecules: supplement A, J. Phys. Chem. Ref. Data, 1998, 27, 2, 115-393, https://doi.org/10.1063/1.556017 . [all data]

Jacox, 2003
Jacox, M.E., Vibrational and electronic energy levels of polyatomic transient molecules: supplement B, J. Phys. Chem. Ref. Data, 2003, 32, 1, 1-441, https://doi.org/10.1063/1.1497629 . [all data]