Artedouglasia oxide A

Van Den Dool and Kratz RI, non-polar column, temperature ramp

View large format table.

Column type Active phase I Reference Comment
CapillaryDB-51533.Isidorov, Zenkevich, et al., 2001He, 3. K/min; Column length: 30. m; Column diameter: 0.25 mm; Tstart: 50. C; Tend: 250. C

Van Den Dool and Kratz RI, non-polar column, custom temperature program

View large format table.

Column type Active phase I Reference Comment
CapillaryHP-5MS1541.7Andriamaharavo, 201430. m/0.25 mm/0.25 μm, He; Program: 60C (1 min) => 5 C/min => 210C => 10 C/min => 280C (15 min)
CapillaryHP-5MS1542.5Andriamaharavo, 201430. m/0.25 mm/0.25 μm, He; Program: 60C (1 min) => 5 C/min => 210C => 10 C/min => 280C (15 min)

Normal alkane RI, non-polar column, temperature ramp

View large format table.

Column type Active phase I Reference Comment
CapillaryZB-11511.Mierendorff, Stahl-Biskup, et al., 200830. m/0.25 mm/0.25 μm, Nitrogen, 3. K/min; Tstart: 45. C; Tend: 230. C
CapillaryHP-5MS1535.Ghasemi, Asghari, et al., 200330. m/0.25 mm/0.25 μm, He, 4. K/min; Tstart: 60. C; Tend: 280. C
CapillaryZB-11511.Mierendorff, Stahl-Biskup, et al., 200330. m/0.25 mm/0.25 μm, N2, 3. K/min; Tstart: 45. C; Tend: 230. C
CapillaryDB-11497.Perez-Alonso, Velasco-Negueruela, et al., 200350. m/0.25 mm/0.25 μm, N2, 4. K/min; Tstart: 95. C; Tend: 240. C

Normal alkane RI, non-polar column, custom temperature program

View large format table.

Column type Active phase I Reference Comment
CapillarySLB-5 MS1529.Costa, De Fina, et al., 200830. m/0.25 mm/0.25 μm, Helium; Program: 50 0C 3 0C/min -> 250 0C (1 min) 10 0C/min -> 300 0C (5 min)
CapillarySLB-5 MS1534.Costa, De Fina, et al., 200830. m/0.25 mm/0.25 μm, Helium; Program: not specified
CapillaryDB-51535.Isidorov, Zenkevich, et al., 2001He; Column length: 30. m; Column diameter: 0.25 mm; Program: not specified
CapillaryCP Sil 5 CB1509.Weyerstahl, Marschall, et al., 1997He; Column length: 25. m; Program: not specified

References

Isidorov, Zenkevich, et al., 2001
Isidorov, V.A.; Zenkevich, I.G.; Krajewska, U.; Dubis, E.N.; Jaroszynska, J.; Bal, K., Gas chromatographic analysis of essential oils with preliminary partition of components, Phytochem. Anal., 2001, 12, 2, 87-90, https://doi.org/10.1002/pca.564 . [all data]

Andriamaharavo, 2014
Andriamaharavo, N.R., Retention Data. NIST Mass Spectrometry Data Center., NIST Mass Spectrometry Data Center, 2014. [all data]

Mierendorff, Stahl-Biskup, et al., 2008
Mierendorff, H.-G.; Stahl-Biskup, E.; Posthumus, M.A.; van Beek, T.A., Composition of commercial Cape chamomile oil (Eriocephalus punctuatus / Eriocephalus tenuifolius), 2008, retrieved from http://www.chemische-analysen-hamburg.de/Publikationen?CapeChamomileOil/. [all data]

Ghasemi, Asghari, et al., 2003
Ghasemi, N.; Asghari, G.; Ardakani, M.S.; Siahpoush, A., Characterization of volatile constituents from aerial parts of varthemia persica DC (var. persica), Iran. J. Pharm. Res., 2003, 2, 241-243. [all data]

Mierendorff, Stahl-Biskup, et al., 2003
Mierendorff, H.-G.; Stahl-Biskup, E.; Posthumus, M.A.; van Beek, T.A., Composition of commercial Cape chamomile oil (Eriocephalus punctulatus), Flavour Fragr. J., 2003, 18, 6, 510-514, https://doi.org/10.1002/ffj.1259 . [all data]

Perez-Alonso, Velasco-Negueruela, et al., 2003
Perez-Alonso, M.J.; Velasco-Negueruela, A.; Palá-Paúl, J.; Sanz, J., Variations in the essential oil composition of Artemisia pedemontana gathered in Spain: chemotype camphor-1,8-cineole and chemotype davanone, Biochem. Syst. Ecol., 2003, 31, 1, 77-84, https://doi.org/10.1016/S0305-1978(02)00082-0 . [all data]

Costa, De Fina, et al., 2008
Costa, R.; De Fina, M.R.; Valentino, M.R.; Rustaiyan, A.; Dugo, P.; Dugo, G.; Mondello, L., An investigation on the volatile composition of some Artemisia species from Iran, Flavour Fragr. J., 2008, 24, 2, 75-82, https://doi.org/10.1002/ffj.1919 . [all data]

Weyerstahl, Marschall, et al., 1997
Weyerstahl, P.; Marschall, H.; Schröder, M.; Wahlburg, H.-C.; Kaul, V.K., The sesquiterpene fraction of the essential oil of Artemisia laciniata Willd., Flavour Fragr. J., 1997, 12, 5, 315-325, https://doi.org/10.1002/(SICI)1099-1026(199709/10)12:5<315::AID-FFJ662>3.0.CO;2-Q . [all data]