Mephobarbital

Normal alkane RI, non-polar column, temperature ramp

Data compiled by: NIST Mass Spectrometry Data Center, William E. Wallace, director

Column type CapillaryCapillaryPackedPackedPacked
Active phase BP-1DB-1OV-1SE-30SE-30
Column length (m)  15.2.2.2.
Carrier gas  He  Nitrogen
Substrate   Gas Chrom PGas Chrom PChromosorb W AW DMS (80-100 mesh)
Column diameter (mm)  0.25
Phase thickness (μm)  0.25
Tstart (C) 100.130.120.120.130.
Tend (C) 300.290.200.200.290.
Heat rate (K/min)  10.2.52.58.
Initial hold (min)  1.  2.
Final hold (min)  10.  8.
I 1874.1876.1885.1895.1885.
ReferenceMHA, 9999Sharp, 1987Marozzi, Gambaro, et al., 1982Marozzi, Gambaro, et al., 1982Peel and Perrigo, 1976
Comment MSDC-RI MSDC-RI MSDC-RI MSDC-RI MSDC-RI
Column type Packed
Active phase SE-30
Column length (m) 2.
Carrier gas N2
Substrate Chromosorb W AW DMS
Column diameter (mm)
Phase thickness (μm)
Tstart (C) 130.
Tend (C) 290.
Heat rate (K/min) 8.
Initial hold (min) 2.
Final hold (min) 8.
I 1885.
ReferencePeel and Perrigo, 1975
Comment MSDC-RI

Kovats' RI, non-polar column, isothermal

View large format table.

Column type Active phase Temperature (C) I Reference Comment
CapillaryBP-1200.1883.Japp, Gill, et al., 198725. m/0.22 mm/0.25 μm, N2
CapillaryBP-1200.1888.Japp, Gill, et al., 198725. m/0.53 mm/1. μm, N2
PackedSE-30200.1875.Stead, Gill, et al., 1982
PackedOV-1200.1890.Berninger and Möller, 1977
PackedOV-101200.1885.Möller, 1976N2, Chromosorb G AW DMCS (80-100 mesh); Column length: 2. m
PackedOV-101200.1890.Möller, 1976N2, Chromosorb G AW DMCS (80-100 mesh); Column length: 2. m
PackedOV-101200.1890.Möller, 1976N2, Chromosorb G AW DMCS (80-100 mesh); Column length: 2. m
PackedOV-101200.1890.Möller, 1976N2, Chromosorb G AW DMCS (80-100 mesh); Column length: 2. m

Kovats' RI, non-polar column, temperature ramp

View large format table.

Column type Active phase I Reference Comment
PackedSE-301895.Maurer, 1990N2, 100. C @ 3. min, 30. K/min, 310. C @ 5. min
PackedOV-1011895.Maurer, 1990, 2N2, Chromosorb G HP, 100. C @ 3. min, 30. K/min, 310. C @ 5. min; Column length: 0.6 m
CapillarySE-301880.Schepers, Wijsbeek, et al., 198212. m/0.22 mm/0.45 μm, He, 120. C @ 2. min, 8. K/min, 300. C @ 12. min
CapillarySE-301875.Schepers, Wijsbeek, et al., 198225. m/0.49 mm/1.14 μm, 100. C @ 2. min, 8. K/min, 275. C @ 15. min

Van Den Dool and Kratz RI, non-polar column, temperature ramp

View large format table.

Column type Active phase I Reference Comment
CapillarySPB-11898.Christ, Noomano, et al., 198830. m/0.75 mm/1.0 μm, He, 10. K/min, 280. C @ 12. min; Tstart: 160. C
CapillaryDB-11869.Perrigo, Peel, et al., 198515. m/0.32 mm/0.25 μm, He, 8. K/min, 280. C @ 5. min; Tstart: 120. C
CapillaryDB-11869.Perrigo, Ballantyne, et al., 198415. m/0.25 mm/0.25 μm, He, 8. K/min, 280. C @ 5. min; Tstart: 120. C

Normal alkane RI, non-polar column, custom temperature program

View large format table.

Column type Active phase I Reference Comment
OtherMethyl Silicone1891.Ardrey and Moffat, 1981Program: not specified

References

MHA, 9999
MHA, Directorate of ForensicScience., Forensic Toxicology, 9999. [all data]

Sharp, 1987
Sharp, M.E., A rapid screening procedure for acidic and neutral drugs in blood by high resolution gas chromatography, J. Anal. Toxicol., 1987, 11, 1, 8-11, https://doi.org/10.1093/jat/11.1.8 . [all data]

Marozzi, Gambaro, et al., 1982
Marozzi, E.; Gambaro, V.; Saligari, E.; Mariani, R.; Lodi, F., Use of the retention index in gas chromatographic studies of drugs, J. Anal. Toxicol., 1982, 6, 4, 185-192, https://doi.org/10.1093/jat/6.4.185 . [all data]

Peel and Perrigo, 1976
Peel, H.W.; Perrigo, B., A practical gas chromatographic screening procedure for toxicological analysis, Can. Soc. Forens. Sci. J., 1976, 9, 2, 69-74, https://doi.org/10.1080/00085030.1976.10757247 . [all data]

Peel and Perrigo, 1975
Peel, H.W.; Perrigo, B., A practical gas chromatographic screening procedure for toxicological analysis, Can.Soc.Forens.Sci.J., 1975, 9, 2, 69-74, https://doi.org/10.1080/00085030.1976.10757247 . [all data]