Thebaine

Van Den Dool and Kratz RI, non-polar column, custom temperature program

Data compiled by: NIST Mass Spectrometry Data Center, William E. Wallace, director

Column type Capillary
Active phase BP-1
Column length (m) 12.
Carrier gas He
Substrate
Column diameter (mm) 0.22
Phase thickness (μm) 0.25
Program 120C => 8C/min => 270C => 25C/min => 300C
I 2492.
ReferenceStowell and Wilson, 1987
Comment MSDC-RI

Kovats' RI, non-polar column, isothermal

Data compiled by: NIST Mass Spectrometry Data Center, William E. Wallace, director

Column type CapillaryCapillaryCapillaryPackedPacked
Active phase BP-1DB-1BP-1OV-1OV-1
Column length (m) 25.30.25. 2.
Carrier gas N2N2N2N2N2
Substrate    Chromosorb GGasChrom Q
Column diameter (mm) 0.220.530.53
Phase thickness (μm) 0.251.51.
Temperature (C) 275.275.275.250.260.
I 2559.2555.2558.2522.2550.
ReferenceJapp, Gill, et al., 1987Japp, Gill, et al., 1987Japp, Gill, et al., 1987Machata and Vycudilik, 1980Cashaw, Walsh, et al., 1971
Comment MSDC-RI MSDC-RI MSDC-RI MSDC-RI MSDC-RI

References

Stowell and Wilson, 1987
Stowell, A.; Wilson, L.W., A simple approach to the interlaboratory transfer of drug retention indices determined by temperature programmed capillary gas chromatography, J. Forensic Sci., 1987, 32, 5, 1214-1220. [all data]