2-Propynylphosphine

Phase change data

Data compiled by: William E. Acree, Jr., James S. Chickos

Enthalpy of vaporization

ΔvapH (kJ/mol) Temperature (K) Reference Comment
36.8250.Shay, Diel, et al., 1988Based on data from 228. - 273. K.

References

Shay, Diel, et al., 1988
Shay, Robert H.; Diel, Bruce N.; Schubert, David M.; Norman, Arlan D., Synthesis and borane coordination of primary alkenyl- and alkynylphosphines, Inorg. Chem., 1988, 27, 13, 2378-2382, https://doi.org/10.1021/ic00286a031 . [all data]