1,4-Dicyclopropylbuta-1,3-diyne

Gas phase thermochemistry data

Data compiled by: Hussein Y. Afeefy, Joel F. Liebman, and Stephen E. Stein

Quantity Value Units Method Reference Comment
Δfgas134.3 ± 0.57kcal/molCcbLuk'yanova, Pimenova, et al., 1992

Condensed phase thermochemistry data

Data compiled by: Hussein Y. Afeefy, Joel F. Liebman, and Stephen E. Stein

Quantity Value Units Method Reference Comment
Δfliquid120.4 ± 0.53kcal/molCcbLuk'yanova, Pimenova, et al., 1992
Quantity Value Units Method Reference Comment
Δcliquid-1402.5 ± 0.53kcal/molCcbLuk'yanova, Pimenova, et al., 1992Corresponding Δfliquid = 120.4 kcal/mol (simple calculation by NIST; no Washburn corrections)

Phase change data

Data compiled as indicated in comments:
ALS - Hussein Y. Afeefy, Joel F. Liebman, and Stephen E. Stein
DRB - Donald R. Burgess, Jr.

Quantity Value Units Method Reference Comment
Δvap13.9 ± 0.24kcal/molCLuk'yanova, Pimenova, et al., 1992ALS
Δvap13.9kcal/molN/ALuk'yanova, Pimenova, et al., 1992DRB

References

Luk'yanova, Pimenova, et al., 1992
Luk'yanova, V.A.; Pimenova, S.M.; Timofeeva, L.P.; Kozina, M.P.; Kolesov, V.P.; Tarakanova, A.V., Standard enthalpies of formation of some derivatives of diacetylene, Russ. J. Phys. Chem. (Engl. Transl.), 1992, 66, 1083-1085. [all data]