(o-Chlorophenyl)urea

Gas phase ion energetics data

Data compiled by: Sharon G. Lias, Rhoda D. Levin, and Sherif A. Kafafi

Ionization energy determinations

IE (eV) Method Reference
8.45EIBaldwin, Loudon, et al., 1976

Appearance energy determinations

Ion AE (eV) Other Products MethodReferenceComment
C6H6NCl+9.15?EIBaldwin, Loudon, et al., 1976
C7H7N2O+9.35ClEIBaldwin, Loudon, et al., 1976

References

Baldwin, Loudon, et al., 1976
Baldwin, M.A.; Loudon, A.G.; Maccoll, A.; Webb, K.S., The nature and fragmentation pathways of the molecular ions of some arylureas, arylthioureas, acetanilides, thioacetanilides and related compounds, Org. Mass Spectrom., 1976, 11, 1181. [all data]