Caryophyllene oxide

Van Den Dool and Kratz RI, non-polar column, custom temperature program

Data compiled by: NIST Mass Spectrometry Data Center, William E. Wallace, director

Column type CapillaryCapillaryCapillaryCapillaryCapillary
Active phase DB-5SE-52BPX-5BP-5VF-5MS
Column length (m) 30.30.25.25.30.
Carrier gas HeHeHeHeHe
Substrate
Column diameter (mm) 0.250.320.320.220.25
Phase thickness (μm) 0.250.150.500.250.25
Program 40C(2min) => 4C/min => 220C => 20C/min => 280C45C => 1C/min => 100C => 5C/min => 250C(10min)60 0C 6 0C/min -> 210 0C 10 0C/min -> 290 0C (20 min)30C(1min) => 50C/min => 105C => 1.5C/min => 150C => 30C/min => 280C (10min)40C(2min) => 5C/min => 200C (2min) => 30C/min => 260C
I 1588.1582.1612.1577.1574.
ReferenceAndrade, Sampaio, et al., 2007Bruni, Bianchi, et al., 2007Eyres, Marriott, et al., 2007Sant'Anna, Fontes, et al., 2007Carasek and Pawliszyn, 2006
Comment MSDC-RI MSDC-RI MSDC-RI MSDC-RI MSDC-RI
Column type CapillaryCapillaryCapillaryCapillaryCapillary
Active phase BPX-5DB-5MSDB-5DB-5SE-52
Column length (m) 30.30.30. 30.
Carrier gas  HeHe He
Substrate
Column diameter (mm) 0.250.250.32 0.32
Phase thickness (μm) 0.250.250.25 0.15
Program 35C(5min) => 3C/min => 210C => 40C/min => 240C (4min)50C(3min) => 200C(2min) => 15C/min => 300C(5min)40C(3min) => 3C/min => 180C => 10C/min => 260C(2min)not specified45C => 1C/min => 100C => 5C/min => 250C(10min)
I 1605.1573.1571.1573.1583.
ReferenceCardeal, da Silva, et al., 2006Eom S.H., Yang H.S., et al., 2006Moon, Cliff, et al., 2006Özel, Gögüs, et al., 2006Sacchetti, Guerrini, et al., 2006
Comment MSDC-RI MSDC-RI MSDC-RI MSDC-RI MSDC-RI
Column type CapillaryCapillaryCapillaryCapillaryCapillary
Active phase HP-5MSSE-52SE-52CBP-55 % Phenyl methyl siloxane
Column length (m) 30.30.25.30.30.
Carrier gas HeHeH2HeHe
Substrate
Column diameter (mm) 0.250.320.320.250.32
Phase thickness (μm) 0.250.150.430.250.15
Program 50C (3min) => 3C/min => 200C => 6C/min => 240C45C => 1C/min => 100C => 5C/min => 250C(10min)60C(8min) => 3C/min => 180C => 20C/min => 250C(10min)60C => 3C/min => 240C => 10C/min => 280C(10min)45C => 1C/min => 100C => 5C/min => 250C (10min)
I 1583.1584.1581.1582.1583.
ReferenceAkpulat, Tepe, et al., 2005Bruni, Pellati, et al., 2005Lorenzo, Paz, et al., 2005Oliveira, Campos, et al., 2005Sacchetti, Maietti, et al., 2005
Comment MSDC-RI MSDC-RI MSDC-RI MSDC-RI MSDC-RI
Column type CapillaryCapillaryCapillaryCapillaryCapillary
Active phase DB-1SE-52CP Sil 8 CBDB-5CBP-5
Column length (m) 30.30.50.30.50.
Carrier gas HeHeHeHeHe
Substrate
Column diameter (mm) 0.320.520.320.250.25
Phase thickness (μm) 0.10.15 0.250.25
Program 40C(5min) => 20C/min => 100C => 2C/min => 160C => 40C/min => 250C (5min)45C => 1C/min => 100C => 5C/min => 250C (10min)60C (2min) => 5C/min => 160C (1min) => 10C/min => 250C (2min)60C(2min) => 3C/min => 240C => 10C/min => 270C (4.5min)60C(2min) => 3C/min => 240C => 10C/min => 280C(10min)
I 1534.11583.1581.1578.1577.
ReferenceHelmig, Bocquet, et al., 2004Sacchetti, Medici, et al., 2004Mockute and Judzentiene, 2003Passos X.S., Castro A.C.M., et al., 2003Azevedo, Campos, et al., 2002
Comment MSDC-RI MSDC-RI MSDC-RI MSDC-RI MSDC-RI
Column type CapillaryCapillaryCapillaryCapillaryCapillary
Active phase HP-5HP-5SE-52BP-1SE-52
Column length (m) 50.50.30.50.25.
Carrier gas HeHeH2 H2
Substrate
Column diameter (mm) 0.20.20.320.220.32
Phase thickness (μm) 0.330.330.420.250.40
Program 50C(2min) => 5C/min => 150C => 10C/min => 250C(30min)50C(2min) => 5C/min => 150C => 10C/min => 250C(30min)60C(8min) => 3C/min => 180C => 20C/min => 250C(10min)not specified60 0C (8 min) 3 K/min -> 180 0C 20 K/min -> 250 0C (10 min)
I 1575.1580.1572.1576.1576.
ReferenceGarcía, Alvarez, et al., 2002García, Alvarez, et al., 2002Lorenzo, Paz, et al., 2002Cavalli, Ranarivelo, et al., 2001Lorenzo, Dellacassa, et al., 2001
Comment MSDC-RI MSDC-RI MSDC-RI MSDC-RI MSDC-RI
Column type CapillaryCapillary
Active phase SE-52HP-5
Column length (m) 30.30.
Carrier gas H2
Substrate
Column diameter (mm) 0.320.25
Phase thickness (μm) 0.400.25
Program 60 0C (8 min) 3 K/min -> 180 0C 20 K/min -> 250 0C (10 min)40C(1min) => 3C/min => 120C => 5C/min => 280C
I 1579.1582.
ReferenceLorenzo, Paz, et al., 2001Isidorov, Krajewska, et al., 2000
Comment MSDC-RI MSDC-RI

Van Den Dool and Kratz RI, polar column, custom temperature program

Data compiled by: NIST Mass Spectrometry Data Center, William E. Wallace, director

Column type CapillaryCapillaryCapillaryCapillaryCapillary
Active phase HP-InnowaxStabilwaxRTX-WaxSupelcowax-10HP-Innowax
Column length (m) 30. 60. 30.
Carrier gas HeHe  He
Substrate
Column diameter (mm) 0.25 0.25 0.25
Phase thickness (μm)   0.25 0.25
Program 40C(8min) => 3C/min => 180C => 20C/min => 230C (20min)50C(8min) => 4C/min => 180C(10min) => 5C/min => 220Cnot specifiednot specified60C(8min) => 3C/min => 180C(5min) => 40C/min => 250C
I 2008.2002.1984.2025.1970.
ReferenceCarrer, Vanderlinde, et al., 2007Hudaib, Speroni, et al., 2002Cavalli, Ranarivelo, et al., 2001Chisholm, Wilson, et al., 2001Bisio, Ciarallo, et al., 1998
Comment MSDC-RI MSDC-RI MSDC-RI MSDC-RI MSDC-RI

Normal alkane RI, non-polar column, temperature ramp

Data compiled by: NIST Mass Spectrometry Data Center, William E. Wallace, director

Column type CapillaryCapillaryCapillaryCapillaryCapillary
Active phase DB-5HP-5 MSHP-1Optima-5RTX-1
Column length (m) 30.60.30.30.60.
Carrier gas HeliumHeliumHeliumHeliumHelium
Substrate
Column diameter (mm) 0.250.250.250.250.22
Phase thickness (μm) 0.250.250.250.250.25
Tstart (C) 60.40.60.60.60.
Tend (C) 240.250.240.246.230.
Heat rate (K/min) 3.3.3.3.2.
Initial hold (min)  1. 1.
Final hold (min)  20.  5.
I 1581.1593.1581.1578.1578.
ReferenceRodriques, Amorim, et al., 2013Sardashti, Valizadeh, et al., 2013Alizadeh and Shaabani, 2012Al-Qudah, Muhaidat, et al., 2012Bendiabdellah, El Amine Dib, et al., 2012
Comment MSDC-RI MSDC-RI MSDC-RI MSDC-RI MSDC-RI
Column type CapillaryCapillaryCapillaryCapillaryCapillary
Active phase RTX-1Mega-5HP-5 MSHP-5 MSPolydimethyl siloxane with 5 % Ph
Column length (m) 60.25.30.30.30.
Carrier gas HeliumHeliumHeliumHeliumHelium
Substrate
Column diameter (mm) 0.220.250.250.25
Phase thickness (μm) 0.250.250.250.25
Tstart (C) 60.50.80.40.80.
Tend (C) 230.220.240.250.200.
Heat rate (K/min) 2.3.4.3.5.
Initial hold (min)  1.3.1.
Final hold (min) 5.5.10.3.25.
I 1578.1579.1577.1581.1580.
ReferenceBendiabdellah, El Amine Dib, et al., 2012Dell'Agli, Sanna, et al., 2012Dutra, Pittella, et al., 2012Jian-Yu, Zhu, et al., 2012Priya, Prathapan, et al., 2012
Comment MSDC-RI MSDC-RI MSDC-RI MSDC-RI MSDC-RI
Column type CapillaryCapillaryCapillaryCapillaryCapillary
Active phase DB-5DB-5HP-5HP-5HP-5
Column length (m) 35.35.25.25.25.
Carrier gas HeliumHeliumHydrogenHydrogenHydrogen
Substrate
Column diameter (mm) 0.200.200.320.320.32
Phase thickness (μm) 0.100.100.520.520.52
Tstart (C) 50.50.40.40.40.
Tend (C) 200.200.280.280.280.
Heat rate (K/min) 4.4.4.4.4.
Initial hold (min)
Final hold (min)   10.10.10.
I 1581.1602.1577.1577.1577.
ReferenceSilva, Suzuki, et al., 2012Silva, Suzuki, et al., 2012Velickovic, Ristic, et al., 2012Velickovic, Ristic, et al., 2012Velickovic, Ristic, et al., 2012
Comment MSDC-RI MSDC-RI MSDC-RI MSDC-RI MSDC-RI
Column type CapillaryCapillaryCapillaryCapillaryCapillary
Active phase HP-5 MSHP-5DB-5 MSDB-1HP-5 MS
Column length (m) 30.30.30.30.30.
Carrier gas HeliumHeliumHeliumHeliumHelium
Substrate
Column diameter (mm) 0.250.250.250.250.25
Phase thickness (μm) 0.250.250.250.250.25
Tstart (C) 50.60.60.40.60.
Tend (C) 250.240.270.210.220.
Heat rate (K/min) 7.3.3.5.4.
Initial hold (min) 1.   20.
Final hold (min) 5.   20.
I 1583.1583.1573.1584.1576.
ReferenceZouari, Ayadi, et al., 2012Bertoli, Lepnardi, et al., 2011Cui, Yang, et al., 2011Fathi, Sahari, et al., 2011Feizbakhsh and Naeemy, 2011
Comment MSDC-RI MSDC-RI MSDC-RI MSDC-RI MSDC-RI
Column type CapillaryCapillaryCapillaryCapillaryCapillary
Active phase DB-5CP-Sil 5 CBHP-5DB-5HP-5
Column length (m) 30.30.30.30.30.
Carrier gas HeliumNitrogenNitrogenNitrogenHydrogen
Substrate
Column diameter (mm) 0.250.250.250.250.25
Phase thickness (μm) 0.250.260.25 0.25
Tstart (C) 60.45.50.60.50.
Tend (C) 240.280.280.250.250.
Heat rate (K/min) 3.3.5.4.5.
Initial hold (min)   1.1.5.
Final hold (min)  22.1.10.5.
I 1581.1580.1576.1583.1581.
ReferenceKarimi, Farmani, et al., 2011Mothana, Hasson, et al., 2011Tekaya-Karoui, Boughalleb, et al., 2011Yousefzadi, Heidari, et al., 2011Abderrahim, Belhamel, et al., 2010
Comment MSDC-RI MSDC-RI MSDC-RI MSDC-RI MSDC-RI
Column type CapillaryCapillaryCapillaryCapillaryCapillary
Active phase Elite-5 MSZB-5 MSHP-5DB-5 MSRTX-1
Column length (m) 30.30.30.25.60.
Carrier gas HeliumHeliumHeliumHeliumHelium
Substrate
Column diameter (mm) 0.250.250.2520.300.22
Phase thickness (μm) 0.250.250.250.250.25
Tstart (C) 40.60.60.50.60.
Tend (C) 220.290.240.240.230.
Heat rate (K/min) 4.5.3.3.2.
Initial hold (min)
Final hold (min)     30.
I 1582.1586.1579.1586.1578.
ReferenceBaharum, Bunawan, et al., 2010Boix, Victorio, et al., 2010Cavar, Maksimovic, et al., 2010Chalchat, Figueredo, et al., 2010Dib, Djabou, et al., 2010
Comment MSDC-RI MSDC-RI MSDC-RI MSDC-RI MSDC-RI
Column type CapillaryCapillaryCapillaryCapillaryCapillary
Active phase DB-5HP-5SPB-1HP-5 MSHP-5 MS
Column length (m) 30.30.30.30.30.
Carrier gas HeliumHeliumHeliumHeliumHelium
Substrate
Column diameter (mm) 0.250.320.250.250.25
Phase thickness (μm) 0.250.250.250.250.25
Tstart (C) 50.60.50.70.70.
Tend (C) 250.240.250.290.290.
Heat rate (K/min) 2.3.5.5.5.
Initial hold (min)  2.3.
Final hold (min)   15.
I 1583.1580.1571.1592.1561.
ReferenceHo, Wang, et al., 2010Kahriman, Tosun, et al., 2010Lazarevic, Palic, et al., 2010Lazarevic, Radulovic, et al., 2010Lazarevic, Radulovic, et al., 2010
Comment MSDC-RI MSDC-RI MSDC-RI MSDC-RI MSDC-RI
Column type CapillaryCapillaryCapillaryCapillaryCapillary
Active phase DB-5DB-5 MSDB-1BP-1HP-5
Column length (m) 30.60.60. 30.
Carrier gas HeliumHeliumNitrogenNitrogenHelium
Substrate
Column diameter (mm) 0.250.250.25 0.25
Phase thickness (μm) 0.250.250.25 0.25
Tstart (C) 60.40.60.60.40.
Tend (C) 240.250.250.220.260.
Heat rate (K/min) 3.5.5.5.4.
Initial hold (min)  15. 10.
Final hold (min)  15. 30.5.
I 1579.1596.1576.1576.1590.
ReferenceMagalhaes, Lima, et al., 2010Mesa-Arango, Betancur-Galvis, et al., 2010Meshkatalsadat, Safaei-Ghomi. J., et al., 2010Mishra, Chaudhary, et al., 2010Miyazawa, Kawauchi, et al., 2010
Comment MSDC-RI MSDC-RI MSDC-RI MSDC-RI MSDC-RI
Column type CapillaryCapillaryCapillaryCapillaryCapillary
Active phase HP-5SPB-1HP-5 MSHP-5 MSHP-5 MS
Column length (m) 30.30.30.30.30.
Carrier gas HeliumHeliumHeliumHeliumHelium
Substrate
Column diameter (mm) 0.250.200.250.250.25
Phase thickness (μm) 0.250.200.250.250.25
Tstart (C) 50.70.60.60.70.
Tend (C) 240.220.220.220.290.
Heat rate (K/min) 3.3.5.5.5.
Initial hold (min) 5. 10.10.
Final hold (min)  15.  10.
I 1595.1557.1582.1583.1592.
ReferenceMonsef-Esfahani, Miri, et al., 2010Neves, Rosa, et al., 2010Ogunwande, Flamini, et al., 2010Ogunwande, Flamini, et al., 2010Radulovic, Blagojevic, et al., 2010
Comment MSDC-RI MSDC-RI MSDC-RI MSDC-RI MSDC-RI
Column type CapillaryCapillaryCapillaryCapillaryCapillary
Active phase HP-5HP-5 MSHP-5 MSDB-1DB-5 MS
Column length (m) 30.30.30.60.30.
Carrier gas HydrogenHeliumHeliumNitrogenHelium
Substrate
Column diameter (mm) 0.250.250.250.250.25
Phase thickness (μm) 0.250.250.250.250.25
Tstart (C) 70.70.60.60.60.
Tend (C) 290.290.220.250.240.
Heat rate (K/min) 5.5.6.4.3.
Initial hold (min)   3.1.
Final hold (min)  10. 10.
I 1593.1586.1599.1579.1578.
ReferenceRadulovic, Dordevic, et al., 2010Radulovic, Dordevic, et al., 2010, 2Safaei-Ghomi and Batooli, 2010Safaei-Ghomi, Meshkatalsadat, et al., 2010Silva, Pott, et al., 2010
Comment MSDC-RI MSDC-RI MSDC-RI MSDC-RI MSDC-RI
Column type CapillaryCapillaryCapillaryCapillaryCapillary
Active phase DB-5DB-5DB-1DB-5HP-5MS
Column length (m) 30.30.30.30.30.
Carrier gas HeliumHeliumHeliumHeliumHelium
Substrate
Column diameter (mm) 0.250.250.250.250.25
Phase thickness (μm) 0.250.250.250.250.25
Tstart (C) 40.80.50.40.50.
Tend (C) 240.240.220.250.250.
Heat rate (K/min) 3.3.4.10.7.
Initial hold (min) 1. 2.1.1.
Final hold (min)  2.2.3.5.
I 1567.1581.1576.1585.1565.
Referencede Souza, Lopes, et al., 2010Vahirua-Lechat, Mitermite, et al., 2010Xu, Tang, et al., 2010Yang, Zhang, et al., 2010Zouari, Zouari, et al., 2010
Comment MSDC-RI MSDC-RI MSDC-RI MSDC-RI MSDC-RI
Column type CapillaryCapillaryCapillaryCapillaryCapillary
Active phase OV-101HP-5 MSSPB-5DB-5HP-5 MS
Column length (m) 50.30.30.30.30.
Carrier gas HeliumHeliumNitrogenHeliumHydrogen
Substrate
Column diameter (mm) 0.250.250.530.250.25
Phase thickness (μm) 0.250.250.500.250.25
Tstart (C) 70.60.50.50.30.
Tend (C) 220.250.210.250.230.
Heat rate (K/min) 2.2.3.5.8.
Initial hold (min)  8.5.2.5.
Final hold (min)  15.45. 10.
I 1577.1601.1599.1582.1607.
ReferenceBenites, Moiteiro, et al., 2009Farhat, Ginies, et al., 2009Gilani, Shah, et al., 2009Ho, Wang, et al., 2009Karlsson, Birgersson, et al., 2009
Comment MSDC-RI MSDC-RI MSDC-RI MSDC-RI MSDC-RI
Column type CapillaryCapillaryCapillaryCapillaryCapillary
Active phase DB-5VF-1 MSRTX-1RTX-1BP-1
Column length (m) 30.30.60.60.50.
Carrier gas HeliumHeliumHeliumHeliumHelium
Substrate
Column diameter (mm) 0.250.250.220.220.22
Phase thickness (μm) 0.250.250.250.250.25
Tstart (C) 70.60.60.60.60.
Tend (C) 240.280.230.230.220.
Heat rate (K/min) 5.4.2.2.2.
Initial hold (min)  5.
Final hold (min)  10.30.30.20.
I 1584.1575.1570.1578.1576.
ReferenceLawal and Oyedelji, 2009Marchesini, Prada, et al., 2009Museli, Pau, et al., 2009Museli, Pau, et al., 2009Ottavioli, Bighelli, et al., 2009
Comment MSDC-RI MSDC-RI MSDC-RI MSDC-RI MSDC-RI
Column type CapillaryCapillaryCapillaryCapillaryCapillary
Active phase DB-55 % Phenyl methyl siloxaneDB-5DB-5DB-5
Column length (m) 30.60.30.30.30.
Carrier gas NitrogenHeliumNitrogenNitrogenHelium
Substrate
Column diameter (mm) 0.250.250.250.250.25
Phase thickness (μm) 0.250.250.250.250.25
Tstart (C) 40.90.40.60.40.
Tend (C) 250.225.230.220.240.
Heat rate (K/min) 3.3.2.5.3.
Initial hold (min) 1.  3.1.
Final hold (min) 10.3. 5.
I 1584.1582.1572.1585.1567.
ReferenceRahimi-Nasrabadi, Gholivand, et al., 2009Retta, Gattuso, et al., 2009Scrivanti, Anton, et al., 2009Soleimani and Azar, 2009de Souza, Lopes, et al., 2009
Comment MSDC-RI MSDC-RI MSDC-RI MSDC-RI MSDC-RI
Column type CapillaryCapillaryCapillaryCapillaryCapillary
Active phase HP-5MSHP-5 MSHP-5HP-5 MSUltra 2
Column length (m) 30.30.30.30.50.
Carrier gas HeliumHeliumHelium Helium
Substrate
Column diameter (mm) 0.250.250.250.250.20
Phase thickness (μm) 0.250.250.25 0.11
Tstart (C) 50.50.50.60.60.
Tend (C) 240.280.280.280.230.
Heat rate (K/min) 5.4.9.3.2.
Initial hold (min)   3. 5.
Final hold (min)   3. 30.
I 1581.1586.1581.1582.1580.
ReferenceWannes, Mhamdi, et al., 2009Zhao, Zeng, et al., 2009Aicha, Ines, et al., 2008Baziou, Couladis, et al., 2008Byun and Shin, 2008
Comment MSDC-RI MSDC-RI MSDC-RI MSDC-RI MSDC-RI
Column type CapillaryCapillaryCapillaryCapillaryCapillary
Active phase SE-52DB-5DB-5DB-5VF-5MS
Column length (m) 50.30.30.30.30.
Carrier gas HeliumHeliumHeliumHeliumHelium
Substrate
Column diameter (mm) 0.250.250.250.250.25
Phase thickness (μm) 0.250.250.250.250.25
Tstart (C) 60.100.100.100.240.
Tend (C) 280.300.300.300.320.
Heat rate (K/min) 3.20.20.20.20.
Initial hold (min)  2.2.2.1.
Final hold (min) 20.10.10.10.
I 1596.1550.1550.1555.1593.
ReferenceDjarri, Medjroubi, et al., 2008Khokra, Prakash, et al., 2008Khokra, Prakash, et al., 2008Khokra, Prakash, et al., 2008Kowalski, 2008
Comment MSDC-RI MSDC-RI MSDC-RI MSDC-RI MSDC-RI
Column type CapillaryCapillaryCapillaryCapillaryCapillary
Active phase HP-5SLB-5 MSZB-1DB-5 MSRTX-1
Column length (m) 30.30.30.30.60.
Carrier gas HeliumHeliumNitrogenHeliumHe
Substrate
Column diameter (mm) 0.320.250.250.250.22
Phase thickness (μm) 0.250.250.250.250.25
Tstart (C) 100.50.45.50.60.
Tend (C) 240.250.230.300.230.
Heat rate (K/min) 5.3.3.5.2.
Initial hold (min) 2.2. 5.
Final hold (min) 5.10. 5.35.
I 1581.1586.1566.1577.1575.
ReferenceLago, Romoff, et al., 2008Lo Presti, Sciarrone, et al., 2008Mierendorff, Stahl-Biskup, et al., 2008Noudogbessi, Yedomonhan, et al., 2008Paolini, Tomi, et al., 2008
Comment MSDC-RI MSDC-RI MSDC-RI MSDC-RI MSDC-RI
Column type CapillaryCapillaryCapillaryCapillaryCapillary
Active phase RTX-1Elite-1HP-5 MSRTX-5HP-5
Column length (m) 60.30.30.20.25.
Carrier gas HeHeliumHeliumHeliumHelium
Substrate
Column diameter (mm) 0.220.320.250.180.25
Phase thickness (μm) 0.250.250.250.200.25
Tstart (C) 60.60.60.50.60.
Tend (C) 230.246.250.280.240.
Heat rate (K/min) 2.3.2.4.4.
Initial hold (min)   8.1.2.
Final hold (min) 35. 15.
I 1543.1576.1589.1588.1581.
ReferencePaolini, Tomi, et al., 2008Raj, Baby, et al., 2008Sahraoui, Vian, et al., 2008Skalicka-Wozniak, Los, et al., 2008Verdian-rizi, 2008
Comment MSDC-RI MSDC-RI MSDC-RI MSDC-RI MSDC-RI
Column type CapillaryCapillaryCapillaryCapillaryCapillary
Active phase DB-5 MSHP-5HP-5 MSSE-54DB-5
Column length (m) 30.30.30.30.50.
Carrier gas HeliumHeliumHeliumHeliumNitrogen
Substrate
Column diameter (mm) 0.250.250.250.250.20
Phase thickness (μm) 0.250.320.250.250.32
Tstart (C) 60.60.50.60.60.
Tend (C) 270.250.230.260.220.
Heat rate (K/min) 3.5.3.2.5.
Initial hold (min)  30.10.5.3.
Final hold (min)   10.20.5.
I 1585.1581.1581.1573.1596.
ReferenceVictorio, Alviano, et al., 2008Yassa and Akhani, 2008Adams, Beauchamp, et al., 2007Alma, Ertas, et al., 2007Amiri, 2007
Comment MSDC-RI MSDC-RI MSDC-RI MSDC-RI MSDC-RI
Column type CapillaryCapillaryCapillaryCapillaryCapillary
Active phase HP-5MSCP Sil 5 CBHP-5MSHP-5MSHP-5 MS
Column length (m) 30.30.30.30.30.
Carrier gas HeN2HeHeHelium
Substrate
Column diameter (mm) 0.250.320.250.250.32
Phase thickness (μm) 0.250.250.250.250.25
Tstart (C) 60.60.60.60.60.
Tend (C) 240.300.280.280.280.
Heat rate (K/min) 3.4.3.3.4.
Initial hold (min)     5.
Final hold (min)
I 1611.1572.1561.1584.1581.
ReferenceArgyropoulou, Daferera, et al., 2007Baran, von Reuss, et al., 2007Basta, Tzakou, et al., 2007Bozin B., Mlmica-Dukic N., et al., 2007Capetanos, Saroglou, et al., 2007
Comment MSDC-RI MSDC-RI MSDC-RI MSDC-RI MSDC-RI
Column type CapillaryCapillaryCapillaryCapillaryCapillary
Active phase HP-5DB-5DB-5MSHP-1HP-5
Column length (m) 30.60.30.30.30.
Carrier gas N2HeHeHeliumHelium
Substrate
Column diameter (mm) 0.250.250.250.250.25
Phase thickness (μm) 0.250.250.250.250.26
Tstart (C) 50.40.60.70.60.
Tend (C) 240.220.240.200.240.
Heat rate (K/min) 5.3.3.10.4.
Initial hold (min) 1.   2.
Final hold (min) 4.   20.
I 1581.1615.1583.1596.1588.
ReferenceCheraif, Ben Jannet, et al., 2007Chyau, Tsai, et al., 2007Da Silva J.K.R., Sousa P.J.C., et al., 2007Dongmo, Tatsadjieu, et al., 2007Farsam, Amanlou, et al., 2007
Comment MSDC-RI MSDC-RI MSDC-RI MSDC-RI MSDC-RI
Column type CapillaryCapillaryCapillaryCapillaryCapillary
Active phase HP-5MSDB-15 % Phenyl methyl siloxaneCol-Elite 5MSHP-1
Column length (m) 30.60.60.30.30.
Carrier gas HeNitrogenHeHeHe
Substrate
Column diameter (mm) 0.250.250.250.250.25
Phase thickness (μm) 0.250.250.250.250.25
Tstart (C) 60.60.90.30.60.
Tend (C) 250.250.225.246.240.
Heat rate (K/min) 2.4.3.3.2.
Initial hold (min) 8.1.
Final hold (min) 15.10.15. 20.
I 1580.1582.1585.1603.1554.
ReferenceFerhat, Tigrine-Kordjani, et al., 2007Ghasempour, Shirinpour, et al., 2007Gil A., Van Baren C.M., et al., 2007Gudaityte and Venskutonis R.P., 2007Hachicha, Skanji, et al., 2007
Comment MSDC-RI MSDC-RI MSDC-RI MSDC-RI MSDC-RI
Column type CapillaryCapillaryCapillaryCapillaryCapillary
Active phase DBP-5CP Sil 5 CBRTX-5 MSBP-1DB-5MS
Column length (m) 25.30.30. 30.
Carrier gas HeliumN2HeHeHe
Substrate
Column diameter (mm) 0.250.250.25 0.25
Phase thickness (μm) 0.220.250.25 0.25
Tstart (C) 40.50.45.60.60.
Tend (C) 250.200.210.220.280.
Heat rate (K/min) 3.5.3.5.3.
Initial hold (min) 1.
Final hold (min) 10.  6.30.
I 1562.1589.1580.1574.1543.
ReferenceHeravi and Sereshti, 2007Hnawia, Cabalion, et al., 2007Hudaib and Aburjai, 2007Kiran, Devi, et al., 2007Marongiu B., Piras A., et al., 2007
Comment MSDC-RI MSDC-RI MSDC-RI MSDC-RI MSDC-RI
Column type CapillaryCapillaryCapillaryCapillaryCapillary
Active phase AT-5DB-5ZB-5DB-1DB-5
Column length (m) 60.30.30.30.30.
Carrier gas HeliumHe HeliumHelium
Substrate
Column diameter (mm) 0.250.250.250.250.25
Phase thickness (μm) 0.250.250.250.250.25
Tstart (C) 60.60.60.50.60.
Tend (C) 260.240.220.260.300.
Heat rate (K/min) 4.2.4.2.53.
Initial hold (min)   5.1.
Final hold (min)   20.20.
I 1586.1571.1582.1547.1555.
ReferenceMeccia, Rojas, et al., 2007Miyazawa and Tamura, 2007Mohottalage, Tabacchi, et al., 2007Monser-Esfahani, Karamkhani, et al., 2007Moreno, Lima, et al., 2007
Comment MSDC-RI MSDC-RI MSDC-RI MSDC-RI MSDC-RI
Column type CapillaryCapillaryCapillaryCapillaryCapillary
Active phase DB-5HP-5HP-5 MSSPB-1SPB-5
Column length (m) 30.25.25.30.30.
Carrier gas HeliumH2HeliumHeHe
Substrate
Column diameter (mm) 0.250.20.250.20.25
Phase thickness (μm) 0.250.330.250.20.25
Tstart (C) 60.60.100.70.50.
Tend (C) 220.240.280.220.250.
Heat rate (K/min) 4.3.4.3.2.
Initial hold (min)   3.
Final hold (min)   5.15.
I 1585.1583.1585.1558.1580.
ReferenceMorteza-Semnani, Saeedi, et al., 2007Oliveira, Leitão, et al., 2007Phutdhawong, Kawaree, et al., 2007Pinto, Salgueiro, et al., 2007Raal, Orav, et al., 2007
Comment MSDC-RI MSDC-RI MSDC-RI MSDC-RI MSDC-RI
Column type CapillaryCapillaryCapillaryCapillaryCapillary
Active phase DB-1HP-5HP-5 MSDB-5DBP-5
Column length (m) 60.30.60.30.25.
Carrier gas NitrogenHeliumHydrogenHeHelium
Substrate
Column diameter (mm) 0.250.250.250.250.25
Phase thickness (μm) 0.250.250.250.250.22
Tstart (C) 60.40.60.50.40.
Tend (C) 250.260.260.240.250.
Heat rate (K/min) 4.4.4.4.3.
Initial hold (min) 1.   1.
Final hold (min) 10. 20. 10.
I 1582.1577.1586.1584.1562.
ReferenceReza, Ebrahim, et al., 2007Ristic, Krivokuca-Dokic, et al., 2007Rojas, Velasco, et al., 2007Sefidkon, Abbasi, et al., 2007Sereshti and Samadi, 2007
Comment MSDC-RI MSDC-RI MSDC-RI MSDC-RI MSDC-RI
Column type CapillaryCapillaryCapillaryCapillaryCapillary
Active phase DB-5DB-5Elite-5MSHP-5 MSHP-5MS
Column length (m) 30.30.30.30.30.
Carrier gas He HeHeliumHe
Substrate
Column diameter (mm) 0.250.250.320.250.25
Phase thickness (μm) 0.250.250.50.250.25
Tstart (C) 60.40.40.60.40.
Tend (C) 320.210.280.280.250.
Heat rate (K/min) 10.2.4.3.3.
Initial hold (min)   5. 5.
Final hold (min) 4.33.10. 10.
I 1582.1577.1588.1583.1558.
ReferenceSmelcerovic, Spiteller, et al., 2007Sylvestre, Longtin, et al., 2007Tava, Pecetti, et al., 2007Vagionas, Graikou, et al., 2007Vichi, Riu-Aumatell, et al., 2007
Comment MSDC-RI MSDC-RI MSDC-RI MSDC-RI MSDC-RI
Column type CapillaryCapillaryCapillaryCapillaryCapillary
Active phase HP-5MSDB-5DB-5ZB-5BP-1
Column length (m) 30.30.30.30.50.
Carrier gas HeHeHe He
Substrate
Column diameter (mm) 0.250.250.250.250.22
Phase thickness (μm) 0.250.250.250.250.25
Tstart (C) 40.60.40.40.60.
Tend (C) 260.300.260.300.220.
Heat rate (K/min) 4.3.4.2.2.
Initial hold (min)   5.
Final hold (min)     20.
I 1578.71573.1577.1562.1568.
ReferenceZizovic, Stamenic, et al., 2007Apel, Sobral, et al., 2006Askari and Sefidkon, 2006Biondi, Sari, et al., 2006Boti, Muselli, et al., 2006
Comment MSDC-RI MSDC-RI MSDC-RI MSDC-RI MSDC-RI
Column type CapillaryCapillaryCapillaryCapillaryCapillary
Active phase BP-1HP-5MSSPB-1DB-1HP-5
Column length (m) 50.30.30.60.30.
Carrier gas  HeHeliumNitrogenHe
Substrate
Column diameter (mm) 0.220.250.200.250.32
Phase thickness (μm) 0.250.250.20 0.25
Tstart (C) 60.60.70.40.60.
Tend (C) 220.280.220.200.246.
Heat rate (K/min) 2.3.3.2.3.
Initial hold (min)    1.
Final hold (min) 20. 15.9.
I 1574.1582.1557.1569.1582.
ReferenceBoti, Yao, et al., 2006Bozin, Mimicá-Dukic, et al., 2006Cavaleiro, Pinto, et al., 2006Chen, Sheu, et al., 2006Coronel, Cerda-Garcia-Rojas, et al., 2006
Comment MSDC-RI MSDC-RI MSDC-RI MSDC-RI MSDC-RI
Column type CapillaryCapillaryCapillaryCapillaryCapillary
Active phase HP-5MSHP-5MSHP-1HP-5HP-1
Column length (m) 30.30.50.30.50.
Carrier gas  HeHeHeHe
Substrate
Column diameter (mm) 0.250.250.20.250.2
Phase thickness (μm) 0.250.250.330.250.33
Tstart (C) 60.50.60.50.60.
Tend (C) 280.250.250.300.250.
Heat rate (K/min) 4.2.2.5.2.
Initial hold (min)    5.
Final hold (min)   60.5.40.
I 1579.1581.1562.1584.1563.
ReferenceEbrahim Sajjadi and Mehregan, 2006Farah, Afifi, et al., 2006Fernandez, Pintaric, et al., 2006Figuérédo, Cabassu, et al., 2006Filippi, Lanfranchi, et al., 2006
Comment MSDC-RI MSDC-RI MSDC-RI MSDC-RI MSDC-RI
Column type CapillaryCapillaryCapillaryCapillaryCapillary
Active phase DB-1DB-5DB-1DB-5DB-1
Column length (m) 60.30.60.30.60.
Carrier gas HeHeHeHe
Substrate
Column diameter (mm) 0.250.250.250.250.25
Phase thickness (μm) 0.250.250.250.250.25
Tstart (C) 60.60.60.60.60.
Tend (C) 240.240.240.240.250.
Heat rate (K/min) 5.5.5.5.5.
Initial hold (min) 2.2.2.2.
Final hold (min)     10.
I 1576.1581.1576.1581.1584.
ReferenceGohari, Hadjiakhoondi, et al., 2006Gohari, Hadjiakhoondi, et al., 2006Gohari A.R., Hadjiakhoondi A., et al., 2006Gohari A.R., Hadjiakhoondi A., et al., 2006Hadian, Sonboli, et al., 2006
Comment MSDC-RI MSDC-RI MSDC-RI MSDC-RI MSDC-RI
Column type CapillaryCapillaryCapillaryCapillaryCapillary
Active phase CP Sil 5 CBDB-5BP-1Methyl SiliconeHP-5
Column length (m) 30.30. 25.30.
Carrier gas  HeliumHeliumHeHelium
Substrate
Column diameter (mm) 0.250.25 0.250.32
Phase thickness (μm) 0.250.25 0.250.25
Tstart (C) 40.60.60.90.60.
Tend (C) 220.260.220.220.260.
Heat rate (K/min) 3.3.5.7.5.
Initial hold (min)    2.2.
Final hold (min) 3. 6. 13.
I 1583.1582.1574.1585.1585.
ReferenceHymete, Rohloff, et al., 2006Javidnia, Miri, et al., 2006Kiran, Bhavani, et al., 2006Kitchlu, Bakshi, et al., 2006Kucuk, Gulec, et al., 2006
Comment MSDC-RI MSDC-RI MSDC-RI MSDC-RI MSDC-RI
Column type CapillaryCapillaryCapillaryCapillaryCapillary
Active phase RTX-1OV-101CP Sil 5 CBCP Sil 5 CBHP-5 MS
Column length (m) 30.25.30.30.30.
Carrier gas HeHeN2N2Nitrogen
Substrate
Column diameter (mm) 0.320.250.320.250.25
Phase thickness (μm) 0.250.250.250.250.25
Tstart (C) 60.100.50.50.50.
Tend (C) 300.250.300.200.280.
Heat rate (K/min) 4.8.4.5.5.
Initial hold (min)
Final hold (min)     5.
I 1589.1581.1570.1581.1576.
ReferenceKula, Izydorczyk, et al., 2006Lattoo, Dhar, et al., 2006Lis and Milczarek, 2006Martin, Joseph, et al., 2006Marzouk, Mansour, et al., 2006
Comment MSDC-RI MSDC-RI MSDC-RI MSDC-RI MSDC-RI
Column type CapillaryCapillaryCapillaryCapillaryCapillary
Active phase HP-5DB-5MSHP-5DB-5CP-Sil 5 CB
Column length (m) 30.30.30.30.25.
Carrier gas N2HeHeliumHeHydrogen
Substrate
Column diameter (mm) 0.250.250.320.250.25
Phase thickness (μm) 0.520.250.250.250.15
Tstart (C) 50.60.40.60.50.
Tend (C) 280.280.240.220.230.
Heat rate (K/min) 5.3.4.4.3.
Initial hold (min)    5.
Final hold (min) 5.30.5.
I 1576.1572.1571.1585.1581.
ReferenceMarzouk, Neffati, et al., 2006Maronigiu, Piras, et al., 2006Miyazawa and Kawata, 2006Morteza-Semnani K., Saeedi M., et al., 2006Olawore, Usman, et al., 2006
Comment MSDC-RI MSDC-RI MSDC-RI MSDC-RI MSDC-RI
Column type CapillaryCapillaryCapillaryCapillaryCapillary
Active phase NB-30DB-5HP-5DB-5DB-5
Column length (m) 30.25.30.30.30.
Carrier gas HeN2HeHydrogenHydrogen
Substrate
Column diameter (mm) 0.20.250.250.250.25
Phase thickness (μm) 0.250.150.250.250.25
Tstart (C) 50.50.60.70.70.
Tend (C) 250.200.220.280.280.
Heat rate (K/min) 2.4.5.4.4.
Initial hold (min)  3.10.4.4.
Final hold (min)
I 1570.1577.1573.1581.1581.
ReferenceOrav, Raal, et al., 2006Ouamba, Ouabonzi, et al., 2006Pintore G., Chessa M., et al., 2006Pino, Marbot, et al., 2006Pino, Marbot, et al., 2006
Comment MSDC-RI MSDC-RI MSDC-RI MSDC-RI MSDC-RI
Column type CapillaryCapillaryCapillaryCapillaryCapillary
Active phase HP-5MSHP-5HP-5MSDB-5DB-5
Column length (m) 30.25.30.30.30.
Carrier gas HeH2 HeHe
Substrate
Column diameter (mm) 0.250.320.250.250.25
Phase thickness (μm) 0.250.250.250.250.25
Tstart (C) 60.60.50.60.60.
Tend (C) 280.240.250.200.260.
Heat rate (K/min) 3.3.10.2.5.
Initial hold (min)   5.
Final hold (min)    60.
I 1550.1587.1598.1579.1604.
ReferencePitarokili, Tzakou, et al., 2006Potzernheim, Bizzo, et al., 2006Robinson, 2006Rout, Naik, et al., 2006Sabulal, Dan, et al., 2006
Comment MSDC-RI MSDC-RI MSDC-RI MSDC-RI MSDC-RI
Column type CapillaryCapillaryCapillaryCapillaryCapillary
Active phase HP-5MSZB-5DB-1FSOT-RSL-200DB-1
Column length (m) 30.30.60.30.60.
Carrier gas HeHe HydrogenHe
Substrate
Column diameter (mm) 0.250.250.250.320.25
Phase thickness (μm) 0.250.250.250.25
Tstart (C) 60.40.70.40.40.
Tend (C) 280.300.230.280.250.
Heat rate (K/min) 4.2.2.6.4.
Initial hold (min)   2.5.
Final hold (min)   20.5.
I 1584.1562.1571.1581.1567.
ReferenceSajjadi, 2006Sari M., Biondi D.M., et al., 2006Sawamura, Onishi, et al., 2006Schmidt, Jirovetz, et al., 2006Sefidkon, Jamzad, et al., 2006
Comment MSDC-RI MSDC-RI MSDC-RI MSDC-RI MSDC-RI
Column type CapillaryCapillaryCapillaryCapillaryCapillary
Active phase DB-5DB-5SPB-5Methyl SiliconeDB-5
Column length (m) 30.30. 25.30.
Carrier gas HeH2HeN2N2
Substrate
Column diameter (mm) 0.250.20 0.30.25
Phase thickness (μm) 0.250.18 0.150.25
Tstart (C) 40.60.50.50.60.
Tend (C) 260.240.250.210.240.
Heat rate (K/min) 2.3.5.2.4.
Initial hold (min) 5. 3.5.
Final hold (min) 20. 15.
I 1577.1579.1581.1604.1584.
ReferenceSenatore, Landolfi, et al., 2006Silva, Oliveira, et al., 2006Stojanovic, Palic, et al., 2006Tonzibo, Coffy, et al., 2006Trilles, Bombarda, et al., 2006
Comment MSDC-RI MSDC-RI MSDC-RI MSDC-RI MSDC-RI
Column type CapillaryCapillaryCapillaryCapillaryCapillary
Active phase HP-5SPB-1DB-5HP-5HP-5
Column length (m) 25.30.30.30.30.
Carrier gas H2HeHeHeHe
Substrate
Column diameter (mm) 0.320.250.250.320.32
Phase thickness (μm) 0.520.250.250.250.25
Tstart (C) 50.50.40.60.60.
Tend (C) 280.250.250.260.260.
Heat rate (K/min) 2.54.4.5.5.
Initial hold (min) 5.1. 2.2.
Final hold (min)  10. 14.14.
I 1581.1550.1586.1581.1584.
ReferenceWang, Kong, et al., 2006Wong, Sivasothy, et al., 2006Yadegarinia, Gachkar, et al., 2006Yayli, Gülec, et al., 2006Yayli, Gülec, et al., 2006
Comment MSDC-RI MSDC-RI MSDC-RI MSDC-RI MSDC-RI
Column type CapillaryCapillaryCapillaryCapillaryCapillary
Active phase SE-30HP-5MSDB-5HP-5MSHP-1
Column length (m) 30.30.30.30.50.
Carrier gas HeHeHeHeHe
Substrate
Column diameter (mm)  0.250.250.250.2
Phase thickness (μm)  0.250.250.250.5
Tstart (C) 90.60.60.60.60.
Tend (C) 220.275.210.280.250.
Heat rate (K/min) 7.4.3.3.2.
Initial hold (min) 2. 5.
Final hold (min)     60.
I 1565.1585.1577.1557.1567.
ReferenceAhuja, Bakshi, et al., 2005Asadipour, Mehrabani, et al., 2005Askari and Sefidkon, 2005Basta, Tzakou, et al., 2005Bendimerad and Bendiab, 2005
Comment MSDC-RI MSDC-RI MSDC-RI MSDC-RI MSDC-RI
Column type CapillaryCapillaryCapillaryCapillaryCapillary
Active phase DB-5DB-5DB-5Methyl SiliconeHP-5
Column length (m) 50.25.30.60.25.
Carrier gas   HeHeHe
Substrate
Column diameter (mm) 0.30.250.250.30.2
Phase thickness (μm) 0.250.150.25 0.33
Tstart (C) 60.40.60.50.60.
Tend (C) 240.220.240.240.240.
Heat rate (K/min) 2.3.3.3.3.
Initial hold (min)  5.
Final hold (min)     7.
I 1582.1582.1586.1584.1576.
ReferenceChagonda and Chalchat, 2005Chagonda and Chalchat, 2005, 2Chaverri and Cicció, 2005Chalchat and Özcan, 2005Duarte, Figueira, et al., 2005
Comment MSDC-RI MSDC-RI MSDC-RI MSDC-RI MSDC-RI
Column type CapillaryCapillaryCapillaryCapillaryCapillary
Active phase DB-1DB-1DB-5HP-1HP-5
Column length (m) 60.60.30.50.30.
Carrier gas HeN2He He
Substrate
Column diameter (mm) 0.250.250.250.20.25
Phase thickness (μm) 0.250.250.250.250.25
Tstart (C) 60.60.60.60.60.
Tend (C) 250.250.300.250.30.
Heat rate (K/min) 5.5.3.2.4.
Initial hold (min)   3.60.3.
Final hold (min)  10.  15.
I 1583.1585.1577.1570.1582.
ReferenceFakhari, Salehi, et al., 2005Fakhari A.R., Sonboli A., et al., 2005Ferraz, Limberger, et al., 2005Fernandez, Lizzani-Cuvelier, et al., 2005Ferretti, Maggi, et al., 2005
Comment MSDC-RI MSDC-RI MSDC-RI MSDC-RI MSDC-RI
Column type CapillaryCapillaryCapillaryCapillaryCapillary
Active phase HP-5HP-5MSCP Sil 5 CBCP Sil 5 CBRSL-200
Column length (m) 30.30.30.30.30.
Carrier gas HeHeN2N2
Substrate
Column diameter (mm) 0.250.250.250.250.25
Phase thickness (μm) 0.250.250.250.250.25
Tstart (C) 50.60.60.60.40.
Tend (C) 300.200.250.250.280.
Heat rate (K/min) 5.4.5.5.6.
Initial hold (min) 5.30.  2.
Final hold (min) 5. 10.10.10.
I 1584.1583.1586.1588.1583.
ReferenceFiguérédo, Cabassu, et al., 2005Gauvin and Smadja, 2005Jassbi, Mehrdad, et al., 2005Jassbi, Mehrdad, et al., 2005Jirovetz, Buchbauer, et al., 2005
Comment MSDC-RI MSDC-RI MSDC-RI MSDC-RI MSDC-RI
Column type CapillaryCapillaryCapillaryCapillaryCapillary
Active phase HP-5DB-1DB-1DB-5DB-5
Column length (m) 25.30.30.30.30.
Carrier gas H2HeHeHeHe
Substrate
Column diameter (mm) 0.320.250.250.320.32
Phase thickness (μm) 0.520.250.25
Tstart (C) 40.50.50.60.60.
Tend (C) 240.265.265.240.240.
Heat rate (K/min) 4.2.52.53.3.
Initial hold (min)  1.1.
Final hold (min)  20.30.
I 1576.1568.1556.1578.1584.
ReferenceJovanovic, Kitic, et al., 2005Khanavi, Ghasemian, et al., 2005Khalighi-Sigaroodi, Hadijiakhoondi, et al., 2005Khayyat and Karimi, 2005Khayyat and Karimi, 2005
Comment MSDC-RI MSDC-RI MSDC-RI MSDC-RI MSDC-RI
Column type CapillaryCapillaryCapillaryCapillaryCapillary
Active phase DB-5DB-5DB-5DB-5MSDB-5
Column length (m) 30.30.30.30.30.
Carrier gas  HeliumHeHeHe
Substrate
Column diameter (mm) 0.250.250.250.250.25
Phase thickness (μm) 0.250.250.250.250.25
Tstart (C) 35.35.60.60.60.
Tend (C) 280.280.230.280.220.
Heat rate (K/min) 4.4.3.3.4.
Initial hold (min) 2.2. 30.5.
Final hold (min)
I 1593.1593.1573.1549.1583.
ReferenceKowalski and Wolski, 2005Kowalski, 2005Limberger, Sobral, et al., 2005Marongiu, Piras, et al., 2005Morteza-Semnani, Akbarzadeh, et al., 2005
Comment MSDC-RI MSDC-RI MSDC-RI MSDC-RI MSDC-RI
Column type CapillaryCapillaryCapillaryCapillaryCapillary
Active phase DB-5DB-5DB-1CP Sil 5 CBCP Sil 5 CB
Column length (m) 30.30.30.25.25.
Carrier gas HeHeN2
Substrate
Column diameter (mm) 0.250.250.250.250.25
Phase thickness (μm) 0.250.250.250.150.15
Tstart (C) 60.60.50.50.50.
Tend (C) 220.220.200.230.230.
Heat rate (K/min) 4.4.5.3.3.
Initial hold (min) 4.4.
Final hold (min)
I 1583.1585.1570.1581.1565.
ReferenceMorteza-Semnani and Saeedi, 2005Morteza-Semnani and Saeedi, 2005, 2Nyegue, Belinga-Ndoye, et al., 2005Ogunwande, Olawore, et al., 2005Olawore, Ogunwande, et al., 2005
Comment MSDC-RI MSDC-RI MSDC-RI MSDC-RI MSDC-RI
Column type CapillaryCapillaryCapillaryCapillaryCapillary
Active phase HP-5DB-5DB-1DB-1HP-5MS
Column length (m) 30.30.50.50.30.
Carrier gas HeHeN2N2
Substrate
Column diameter (mm) 0.250.320.250.250.2
Phase thickness (μm) 0.250.250.250.25
Tstart (C) 70.40.95.95.60.
Tend (C) 240.250.240.240.280.
Heat rate (K/min) 5.5.4.4.3.
Initial hold (min)  0.5
Final hold (min)  2.
I 1589.1573.1580.1580.1583.
ReferenceOyedeji, Yani, et al., 2005Özel, Gögüs, et al., 2005Palá-Paúl, Pérez-Alonso, et al., 2005Pala-Paul, Perez-Alonso, et al., 2005Petrakis, Roussis, et al., 2005
Comment MSDC-RI MSDC-RI MSDC-RI MSDC-RI MSDC-RI
Column type CapillaryCapillaryCapillaryCapillaryCapillary
Active phase Methyl SiliconeHP-5MSHP-5MSHP-5MSHP-5MS
Column length (m) 12.530.30.30.30.
Carrier gas HeHeHeHeHe
Substrate
Column diameter (mm) 0.250.250.250.250.25
Phase thickness (μm) 0.250.250.250.250.25
Tstart (C) 50.60.60.60.60.
Tend (C) 270.220.280.275.280.
Heat rate (K/min) 4.6.4.4.4.
Initial hold (min)  3.
Final hold (min)
I 1576.1601.1582.1610.1580.
ReferenceRicci, Fraternale, et al., 2005Safaei-Ghomi, Bamoniri, et al., 2005Sajjadi S.E. and Eskandari B., 2005Sajjadi and Ghannadi, 2005Sajjadi, 2005
Comment MSDC-RI MSDC-RI MSDC-RI MSDC-RI MSDC-RI
Column type CapillaryCapillaryCapillaryCapillaryCapillary
Active phase DB-5DB-1DB-5DB-5HP-5MS
Column length (m) 30.30.30.30.30.
Carrier gas HeHeHeHeHe
Substrate
Column diameter (mm) 0.250.250.250.250.25
Phase thickness (μm) 0.250.25 0.250.25
Tstart (C) 60.50.40.40.60.
Tend (C) 220.265.240.260.280.
Heat rate (K/min) 3.2.54.2.3.
Initial hold (min) 4.1. 5.5.
Final hold (min)  20. 20.
I 1584.1547.1580.1577.1581.
ReferenceSalehi, Sefidkon, et al., 2005Sarkhail, Amin, et al., 2005Sefidkon and Jamzad, 2005Senatore, Apostolides Arnold, et al., 2005Setzer, Noletto, et al., 2005
Comment MSDC-RI MSDC-RI MSDC-RI MSDC-RI MSDC-RI
Column type CapillaryCapillaryCapillaryCapillaryCapillary
Active phase DB-5PE-5DB-5HP-5MSDB-1
Column length (m) 30.30.30.30.60.
Carrier gas HeH2HeHeHe
Substrate
Column diameter (mm) 0.250.320.250.250.25
Phase thickness (μm) 0.250.250.250.250.25
Tstart (C) 60.60.60.60.60.
Tend (C) 300.230.230.280.250.
Heat rate (K/min) 3.5.3.3.5.
Initial hold (min)  2.
Final hold (min)  4.20. 10.
I 1576.1580.1583.1583.1579.
ReferenceSimoes-Pires C.A., Debenedetti S., et al., 2005Singh, Raina, et al., 2005Skoula and Grayer, 2005Slavkovska, Couladis, et al., 2005Sonboli, Salehi, et al., 2005
Comment MSDC-RI MSDC-RI MSDC-RI MSDC-RI MSDC-RI
Column type CapillaryCapillaryCapillaryCapillaryCapillary
Active phase BP-1DB-5CP Sil 8 CBHP-5 MSHP-5MS
Column length (m) 30.30.30.30.30.
Carrier gas N2 HeHeHe
Substrate
Column diameter (mm) 0.320.250.250.250.25
Phase thickness (μm) 0.250.25 0.500.25
Tstart (C) 60.40.60.60.60.
Tend (C) 220.210.290.260.280.
Heat rate (K/min) 5.2.3.3.3.
Initial hold (min)  2.5.
Final hold (min) 15.33. 20.
I 1571.1582.1574.1590.1548.
ReferenceSrivastava, Srivastava, et al., 2005Stevanovic, Garneau, et al., 2005Suárez, Vásquez, et al., 2005Topçu, Barla, et al., 2005Tzakou, Bazos, et al., 2005
Comment MSDC-RI MSDC-RI MSDC-RI MSDC-RI MSDC-RI
Column type CapillaryCapillaryCapillaryCapillaryCapillary
Active phase DB-5HP-5 MSHP-5DB-1HP-5MS
Column length (m) 30.30.30.50.30.
Carrier gas HeHeliumHeliumN2
Substrate
Column diameter (mm) 0.320.250.320.250.25
Phase thickness (μm) 0.250.250.250.250.25
Tstart (C) 60.60.40.90.40.
Tend (C) 280.240.300.240.220.
Heat rate (K/min) 3.3.4.4.3.
Initial hold (min)     5.
Final hold (min)   5. 10.
I 1562.1583.1572.1579.1558.
ReferenceTzakou and Constantinidis, 2005Urdampilleta, Amat, et al., 2005Utsunomia, Kawata, et al., 2005Velasco-Negueruela, Pérez-Alonso, et al., 2005Vichi, Riu-Aumatell, et al., 2005
Comment MSDC-RI MSDC-RI MSDC-RI MSDC-RI MSDC-RI
Column type CapillaryCapillaryCapillaryCapillaryCapillary
Active phase HP-5DB-5HP-5CP Sil 5 CBDB-5
Column length (m) 30.30.30.30.30.
Carrier gas HeH2HeN2He
Substrate
Column diameter (mm) 0.320.250.250.250.25
Phase thickness (μm) 0.250.250.320.250.25
Tstart (C) 60.50.60.50.90.
Tend (C) 260.290.250.200.220.
Heat rate (K/min) 5.4.5.5.7.
Initial hold (min) 2. 3. 2.
Final hold (min) 13.   5.
I 1585.1581.1575.1580.1565.
ReferenceYayli, Yasar, et al., 2005Abreu, Reis, et al., 2004Aghel, Yamini, et al., 2004Agnaniet, Menut, et al., 2004Agnihotri, Thappa, et al., 2004
Comment MSDC-RI MSDC-RI MSDC-RI MSDC-RI MSDC-RI
Column type CapillaryCapillaryCapillaryCapillaryCapillary
Active phase BP-1SPB-5DB-5DB-1ZB-5
Column length (m) 50.60.30.25.60.
Carrier gas  HeN2 He
Substrate
Column diameter (mm) 0.220.320.250.250.25
Phase thickness (μm) 0.251.0.250.250.25
Tstart (C) 60.60.40.60.40.
Tend (C) 220.200.230.180.260.
Heat rate (K/min) 2.4.2.3.6.
Initial hold (min)    10.4.6
Final hold (min) 20.30. 10.1.
I 1572.1605.1581.1583.1619.
ReferenceBlanc, Muselli, et al., 2004Gauvin, Ravaomanarivo, et al., 2004González, Guerra, et al., 2004bin Jantan, Ayop, et al., 2004Jürgens and Dötterl, 2004
Comment MSDC-RI MSDC-RI MSDC-RI MSDC-RI MSDC-RI
Column type CapillaryCapillaryCapillaryCapillaryCapillary
Active phase RTX-1SE-54DB-5HP-5MSDB-5MS
Column length (m) 30.30.30.30.30.
Carrier gas N2HeHeHeHe
Substrate
Column diameter (mm) 0.250.250.250.250.25
Phase thickness (μm) 0.250.250.250.250.25
Tstart (C) 60.60.60.50.60.
Tend (C) 300.260.300.230.240.
Heat rate (K/min) 4.2.3.5.3.
Initial hold (min)  5. 2.
Final hold (min)    10.
I 1573.1571.1567.1562.1581.
ReferenceKalemba and Thiem, 2004Kilic, Hafizoglu, et al., 2004Lago, de Ávila, et al., 2004Li and Jiang, 2004paz Lima, Silva, et al., 2004
Comment MSDC-RI MSDC-RI MSDC-RI MSDC-RI MSDC-RI
Column type CapillaryCapillaryCapillaryCapillaryCapillary
Active phase DB-5RTX-1DB-5HP-5MSHP-5MS
Column length (m) 30.30.30.30.30.
Carrier gas HeN2 HeHe
Substrate
Column diameter (mm) 0.250.320.250.250.25
Phase thickness (μm) 0.250.250.250.250.25
Tstart (C) 60.60.40.60.60.
Tend (C) 300.300.210.280.280.
Heat rate (K/min) 3.4.2.3.3.
Initial hold (min)   2.
Final hold (min)   33.
I 1577.1574.1578.1588.1577.
ReferenceLimberger, Sobral, et al., 2004Lis, Boczek, et al., 2004Lopez Arze, Collin, et al., 2004Malencic, Couladis, et al., 2004Malencic, Couladis, et al., 2004
Comment MSDC-RI MSDC-RI MSDC-RI MSDC-RI MSDC-RI
Column type CapillaryCapillaryCapillaryCapillaryCapillary
Active phase HP-5MSBP-1DB-5MSHP-5MSDB-5
Column length (m) 30.25.30.30.30.
Carrier gas HeN2HeHe
Substrate
Column diameter (mm) 0.250.250.250.250.25
Phase thickness (μm) 0.250.250.250.250.15
Tstart (C) 60.60.60.60.60.
Tend (C) 280.220.280.275.220.
Heat rate (K/min) 3.5.3.4.3.
Initial hold (min)     3.
Final hold (min)   30.
I 1578.1577.1541.1593.1579.
ReferenceMalencic, Couladis, et al., 2004Mallavarapu, Kulkarni, et al., 2004Marongiu, Porcedda, et al., 2004Mehrabani, Asadipour, et al., 2004Mevy, Bessiere, et al., 2004
Comment MSDC-RI MSDC-RI MSDC-RI MSDC-RI MSDC-RI
Column type CapillaryCapillaryCapillaryCapillaryCapillary
Active phase HP-5MSDB-5DB-5NB-30NB-30
Column length (m) 30.30.50.50.50.
Carrier gas HeHeliumHeliumHeHe
Substrate
Column diameter (mm) 0.250.250.250.20.2
Phase thickness (μm) 0.25  0.250.25
Tstart (C) 60.60.60.50.50.
Tend (C) 280.240.240.250.250.
Heat rate (K/min) 3.2.2.2.2.
Initial hold (min)
Final hold (min)  999.999.
I 1582.1573.1573.1575.1575.
ReferenceMimica-Dukic, Bozin, et al., 2004Miyazawa, Fuhita, et al., 2004Miyazawa, Fujita, et al., 2004Orav, Stulova, et al., 2004Orav, Stulova, et al., 2004
Comment MSDC-RI MSDC-RI MSDC-RI MSDC-RI MSDC-RI
Column type CapillaryCapillaryCapillaryCapillaryCapillary
Active phase DB-5DB-1DB-1DB-1DB-1
Column length (m) 30.50.50.60.60.
Carrier gas HeHeN2HeHe
Substrate
Column diameter (mm) 0.250.220.250.320.32
Phase thickness (μm) 0.250.250.250.250.25
Tstart (C) 35.70.95.35.35.
Tend (C) 220.220.240.230.230.
Heat rate (K/min) 3.4.4.2.2.
Initial hold (min)    4.4.
Final hold (min)    25.25.
I 1585.1574.1558.1550.1557.
ReferencePalá-Paúl, Brophy, et al., 2004Palá-Paúl, García-Jiménez, et al., 2004Palá-Paúl, Velasco-Negueruela, et al., 2004Park, Lee, et al., 2004Park, Lee, et al., 2004
Comment MSDC-RI MSDC-RI MSDC-RI MSDC-RI MSDC-RI
Column type CapillaryCapillaryCapillaryCapillaryCapillary
Active phase DB-1DB-1NB-30DB-5HP-5MS
Column length (m) 60.60.50.30.30.
Carrier gas HeHeHeHeHe
Substrate
Column diameter (mm) 0.320.320.200.250.25
Phase thickness (μm) 0.250.250.250.250.25
Tstart (C) 35.35.50.35.60.
Tend (C) 230.230.250.220.280.
Heat rate (K/min) 2.2.2.2.54.
Initial hold (min) 4.4.
Final hold (min) 25.25. 6.
I 1558.1560.1578.1583.1574.
ReferencePark, Lee, et al., 2004Park, Lee, et al., 2004Raal, Paaver, et al., 2004Rohloff, Mordal, et al., 2004Sadeghpour, Asghari, et al., 2004
Comment MSDC-RI MSDC-RI MSDC-RI MSDC-RI MSDC-RI
Column type CapillaryCapillaryCapillaryCapillaryCapillary
Active phase DB-1DB-5HP-1HP-5HP-5
Column length (m) 30.30.30.25.25.
Carrier gas He HeN2H2
Substrate
Column diameter (mm) 0.250.250.250.20.32
Phase thickness (μm) 0.250.250.330.50.52
Tstart (C) 50.50.40.30.40.
Tend (C) 265.250.260.280.240.
Heat rate (K/min) 2.53.2.3.4.
Initial hold (min) 1.5.5.
Final hold (min) 20. 20.
I 1547.1581.1580.1604.1581.
ReferenceSarkhail, Amin, et al., 2004Sefidkon, Jamzad, et al., 2004Senatore, Napolitano, et al., 2004Shafi, Nambiar, et al., 2004Simic, Sokovic, et al., 2004
Comment MSDC-RI MSDC-RI MSDC-RI MSDC-RI MSDC-RI
Column type CapillaryCapillaryCapillaryCapillaryCapillary
Active phase CP Sil 5 CBBPX-5HP-5MSHP-5HP-5MS
Column length (m) 20.25.30.30.30.
Carrier gas HeHeHeN2He
Substrate
Column diameter (mm) 0.250.220.250.250.25
Phase thickness (μm) 0.251.0.250.250.25
Tstart (C) 100.60.60.60.60.
Tend (C) 270.250.275.220.280.
Heat rate (K/min) 8.3.4.5.3.
Initial hold (min) 2.5. 10.
Final hold (min)  10.
I 1570.1619.1580.1576.1578.
ReferenceThappa, Bakshi, et al., 2004Vilaseca, Guy, et al., 2004Afsharypuor and Jahromy, 2003Bertoli, Menichini, et al., 2003Couladis, Özcan, et al., 2003
Comment MSDC-RI MSDC-RI MSDC-RI MSDC-RI MSDC-RI
Column type CapillaryCapillaryCapillaryCapillaryCapillary
Active phase DB-1RTX-5SilHP-1DB-1HP-5MS
Column length (m) 60.30.30.30.30.
Carrier gas HeHeHeN2He
Substrate
Column diameter (mm) 0.250.250.250.250.25
Phase thickness (μm)  0.250.250.250.25
Tstart (C) 50.70.70.50.60.
Tend (C) 250.200.200.200.275.
Heat rate (K/min) 4.4.10.5.4.
Initial hold (min)
Final hold (min)  10.
I 1569.1582.1578.1555.1581.
ReferenceDabiri and Sefidkon, 2003Dudai, Larkov, et al., 2003Fekam Boyom, Amvam Zollo, et al., 2003Fekam Boyom, Ngouana, et al., 2003Ghannadi, Aghazari, et al., 2003
Comment MSDC-RI MSDC-RI MSDC-RI MSDC-RI MSDC-RI
Column type CapillaryCapillaryCapillaryCapillaryCapillary
Active phase RSL-200RSL-200DB-5CP Sil 5 CBDB-5
Column length (m) 30.30.50.25.30.
Carrier gas H2H2HeHeHe
Substrate
Column diameter (mm) 0.320.320.20.250.25
Phase thickness (μm) 0.250.250.250.250.25
Tstart (C) 40.40.50.35.60.
Tend (C) 280.280.220.280.250.
Heat rate (K/min) 6.6.3.5.3.
Initial hold (min) 5.5.2.2.5
Final hold (min) 5.5.10.
I 1577.1578.1579.1562.1580.
ReferenceJirovetz, Buchbauer, et al., 2003Jirovetz, Buchbauer, et al., 2003, 2Juteau, Jerkovic, et al., 2003Kanjilal, Kotoky, et al., 2003Limberger, Simões-Pires, et al., 2003
Comment MSDC-RI MSDC-RI MSDC-RI MSDC-RI MSDC-RI
Column type CapillaryCapillaryCapillaryCapillaryCapillary
Active phase DB-5MSDB-5DB-5DB-5ZB-1
Column length (m) 30.30.30.30.30.
Carrier gas HeHeHeHeN2
Substrate
Column diameter (mm) 0.250.250.250.250.25
Phase thickness (μm) 0.250.250.250.250.25
Tstart (C) 60.60.60.60.45.
Tend (C) 240.280.280.280.230.
Heat rate (K/min) 3.3.3.3.3.
Initial hold (min)
Final hold (min)  30.30.30.
I 1583.1563.1567.1565.1566.
ReferenceMaia, Taveira, et al., 2003Marongiu, Porcedda, et al., 2003Marongiu, Porcedda, et al., 2003Marongiu, Porcedda, et al., 2003Mierendorff, Stahl-Biskup, et al., 2003
Comment MSDC-RI MSDC-RI MSDC-RI MSDC-RI MSDC-RI
Column type CapillaryCapillaryCapillaryCapillaryCapillary
Active phase DB-1HP-5DB-5CP Sil 5 CBDB-1
Column length (m) 60.30.30.25.50.
Carrier gas HeHeliumHeH2N2
Substrate
Column diameter (mm) 0.250.320.250.250.25
Phase thickness (μm) 0.25 0.250.150.25
Tstart (C) 50.70.60.50.95.
Tend (C) 270.210.275.230.240.
Heat rate (K/min) 4.2.4.3.4.
Initial hold (min)   5.
Final hold (min)  60.
I 1567.1578.1576.1556.1579.
ReferenceMirza and Nik, 2003Mookdasanit, Tamura, et al., 2003Morteza-Semnani and Saeedi, 2003Oyedeji, Ekundayo, et al., 2003Perez-Alonso, Velasco-Negueruela, et al., 2003
Comment MSDC-RI MSDC-RI MSDC-RI MSDC-RI MSDC-RI
Column type CapillaryCapillaryCapillaryCapillaryCapillary
Active phase HP-5DB-1DB-1DB-1DB-5
Column length (m) 30.60.60.60.30.
Carrier gas HeHeHeHeN2
Substrate
Column diameter (mm) 0.250.250.250.250.25
Phase thickness (μm) 0.250.250.250.250.25
Tstart (C) 60.50.40.40.40.
Tend (C) 280.250.220.220.230.
Heat rate (K/min) 3.4.4.4.2.
Initial hold (min)
Final hold (min)
I 1565.1566.1574.1574.1581.
ReferencePitarokili, Tzakou, et al., 2003Pourmortazavi, Sefidkon, et al., 2003Rasooli and Mirmostafa, 2003Rasooli and Mirmostafa, 2003Rotman, Ahumada, et al., 2003
Comment MSDC-RI MSDC-RI MSDC-RI MSDC-RI MSDC-RI
Column type CapillaryCapillaryCapillaryCapillaryCapillary
Active phase HP-5Methyl SiliconeDB-1DB-1DB-5
Column length (m) 30. 60.60.30.
Carrier gas HeHeHeHeHe
Substrate
Column diameter (mm) 0.25 0.250.250.25
Phase thickness (μm) 0.25 0.250.250.25
Tstart (C) 60.35.40.50.60.
Tend (C) 280.180.260.280.240.
Heat rate (K/min) 4.4.4.4.3.
Initial hold (min)   5.
Final hold (min)
I 1578.1576.1564.1566.1583.
ReferenceSajjadi and Mehregan, 2003Santos and Cordeiro, 2003Sefidkon, Naderi Nik, et al., 2003Shahmir, Ahmadi, et al., 2003da Silva, Luz, et al., 2003
Comment MSDC-RI MSDC-RI MSDC-RI MSDC-RI MSDC-RI
Column type CapillaryCapillaryCapillaryCapillaryCapillary
Active phase HP-5HP-5HP-5CP Sil 5 CBDB-1
Column length (m) 60.60.60.25.50.
Carrier gas     N2
Substrate
Column diameter (mm) 0.250.250.250.250.25
Phase thickness (μm) 0.250.250.250.150.25
Tstart (C) 40.40.40.50.90.
Tend (C) 250.250.250.230.240.
Heat rate (K/min) 5.5.5.3.4.
Initial hold (min) 15.15.15.
Final hold (min)
I 1580.1580.1581.1582.1541.
ReferenceStashenko, Jaramillo, et al., 2003Stashenko, Jaramillo, et al., 2003Stashenko, Jaramillo, et al., 2003Taiwo and Bolanle, 2003Velasco-Negueruela, Pérez-Alonso, et al., 2003
Comment MSDC-RI MSDC-RI MSDC-RI MSDC-RI MSDC-RI
Column type CapillaryCapillaryCapillaryCapillaryCapillary
Active phase HP-5HP-5HP-5HP-5HP-5
Column length (m) 25.25.25.25.25.
Carrier gas H2H2HeliumHeliumHelium
Substrate
Column diameter (mm) 0.320.320.320.320.32
Phase thickness (μm) 0.530.530.530.530.53
Tstart (C) 40.40.40.40.40.
Tend (C) 280.280.280.280.280.
Heat rate (K/min) 4.4.4.4.4.
Initial hold (min)
Final hold (min)
I 1579.1583.1577.1578.1578.
ReferenceVelickovic, Randjelovic, et al., 2003Velickovic, Randjelovic, et al., 2003Velickovic, Ristic, et al., 2003Velickovic, Ristic, et al., 2003Velickovic, Ristic, et al., 2003
Comment MSDC-RI MSDC-RI MSDC-RI MSDC-RI MSDC-RI
Column type CapillaryCapillaryCapillaryCapillaryCapillary
Active phase HP-5HP-5DB-5DB-5CP Sil 5 CB
Column length (m) 25.25.30.25.25.
Carrier gas HeliumHeliumHeN2N2
Substrate
Column diameter (mm) 0.320.320.250.250.25
Phase thickness (μm) 0.530.530.250.250.4
Tstart (C) 40.40.60.50.60.
Tend (C) 280.280.240.250.260.
Heat rate (K/min) 4.4.3.4.5.
Initial hold (min)
Final hold (min)    10.40.
I 1579.1583.1581.1581.1565.
ReferenceVelickovic, Ristic, et al., 2003Velickovic, Ristic, et al., 2003Zoghbi, Andrade, et al., 2003Zrira, Elamrani, et al., 2003Azaz. D., Demirci, et al., 2002
Comment MSDC-RI MSDC-RI MSDC-RI MSDC-RI MSDC-RI
Column type CapillaryCapillaryCapillaryCapillaryCapillary
Active phase OV-101DB-5HP-15 % Phenyl methyl siloxaneDB-5MS
Column length (m) 25.30.30.30.30.
Carrier gas  HeHeHeHe
Substrate
Column diameter (mm) 0.320.250.250.250.25
Phase thickness (μm)  0.250.250.250.25
Tstart (C) 50.60.70.75.60.
Tend (C) 200.280.220.200.280.
Heat rate (K/min) 5.3.3.3.3.
Initial hold (min)    4.
Final hold (min)  30.15.8.
I 1578.1567.1557.1583.1576.
ReferenceBoyom, Keumedjio, et al., 2002Caredda, Marongiu, et al., 2002Cavaleiro, Salgueiro, et al., 2002Cicció and Gómez-Laurito, 2002Congiu, Falconieri, et al., 2002
Comment MSDC-RI MSDC-RI MSDC-RI MSDC-RI MSDC-RI
Column type CapillaryCapillaryCapillaryCapillaryCapillary
Active phase DB-5MSBP-1DB-5HP-5PTE-5
Column length (m) 30.25.30.30.60.
Carrier gas HeN2HeHeH2
Substrate
Column diameter (mm) 0.250.500.250.250.32
Phase thickness (μm) 0.250.250.250.250.30
Tstart (C) 60.60.60.60.60.
Tend (C) 280.220.240.275.285.
Heat rate (K/min) 3.5.3.4.4.3
Initial hold (min)
Final hold (min)  10.
I 1576.1577.1584.1576.1581.
ReferenceCongiu, Falconieri, et al., 2002Das, Ram, et al., 2002Flamini, Ertugrul, et al., 2002Ghannadi, Sajjadi, et al., 2002Gudzic, Djokovic, et al., 2002
Comment MSDC-RI MSDC-RI MSDC-RI MSDC-RI MSDC-RI
Column type CapillaryCapillaryCapillaryCapillaryCapillary
Active phase SE-30RSL-200RSL-200CP Sil 8 CBDB-5
Column length (m) 50.30.30.30.30.
Carrier gas HeH2H2He
Substrate
Column diameter (mm) 0.250.320.320.250.25
Phase thickness (μm) 0.250.250.250.250.25
Tstart (C) 70.40.50.50.40.
Tend (C) 240.280.280.220.210.
Heat rate (K/min) 4.6.6.3.2.
Initial hold (min)  5.5.2.2.
Final hold (min)  5.5. 33.
I 1574.1572.1564.1578.1581.
ReferenceIñigo, Palá-Paúl, et al., 2002Jirovetz, Buchbauer, et al., 2002Jirovetz, Ngassoum, et al., 2002Juteau, Masotti, et al., 2002Kabouss, Charrouf, et al., 2002
Comment MSDC-RI MSDC-RI MSDC-RI MSDC-RI MSDC-RI
Column type CapillaryCapillaryCapillaryCapillaryCapillary
Active phase SPB-5DB-5DB-5DB-5OV-101
Column length (m) 60.30.30.30.25.
Carrier gas HeHeHeHeHe
Substrate
Column diameter (mm) 0.250.250.250.250.32
Phase thickness (μm) 0.250.250.250.25
Tstart (C) 50.60.35.35.50.
Tend (C) 240.240.280.280.200.
Heat rate (K/min) 5.3.3.4.5.
Initial hold (min) 3. 2.2.
Final hold (min) 10. 15.15.
I 1563.1581.1594.1592.1576.
ReferenceKim and Lee, 2002Kobaisy, Tellez, et al., 2002Krauze-Baranowska, Mardarowicz, et al., 2002Krauze-Baranowska, Mardarowicz, et al., 2002, 2Kuiate, Bessière, et al., 2002
Comment MSDC-RI MSDC-RI MSDC-RI MSDC-RI MSDC-RI
Column type CapillaryCapillaryCapillaryCapillaryCapillary
Active phase DB-5DB-5HP-5DB-5DB-5
Column length (m) 30.30.30.25.30.
Carrier gas HeHe N2He
Substrate
Column diameter (mm) 0.250.320.250.230.25
Phase thickness (μm) 0.250.250.250.150.25
Tstart (C) 60.40.60.50.60.
Tend (C) 250.290.275.250.240.
Heat rate (K/min) 3.7.4.3.3.
Initial hold (min)   4.
Final hold (min)
I 1569.1600.1575.1577.1583.
ReferenceLimberger, Simões-Pires, et al., 2002Lin, Rouseff, et al., 2002Lockwood, Asghari, et al., 2002Mahmout, Bessière, et al., 2002Maia, da Silva, et al., 2002
Comment MSDC-RI MSDC-RI MSDC-RI MSDC-RI MSDC-RI
Column type CapillaryCapillaryCapillaryCapillaryCapillary
Active phase DB-5MSOV-101DB-5DB-1HP-5
Column length (m) 30.25.30.30.30.
Carrier gas HeHeHeHe
Substrate
Column diameter (mm) 0.250.320.250.250.25
Phase thickness (μm) 0.25 0.250.250.25
Tstart (C) 60.50.60.60.60.
Tend (C) 240.200.220.250.240.
Heat rate (K/min) 3.5.4.4.3.
Initial hold (min)   5.10.
Final hold (min)
I 1581.1574.1583.1592.1592.
ReferenceMaia, Zoghbi, et al., 2002Menut, Bessière, et al., 2002Morteza-Semnani, Saeedi, et al., 2002Norouzi-Arasi, Yavari, et al., 2002Novak, Langbehn, et al., 2002
Comment MSDC-RI MSDC-RI MSDC-RI MSDC-RI MSDC-RI
Column type CapillaryCapillaryCapillaryCapillaryCapillary
Active phase HP-5DB-1DB-5MSDB-5DB-5
Column length (m) 30.50.30.30.25.
Carrier gas  N2HeHeHe
Substrate
Column diameter (mm) 0.250.250.320.250.2
Phase thickness (μm) 0.250.250.250.25
Tstart (C) 60.80.40.60.60.
Tend (C) 240.225.280.300.220.
Heat rate (K/min) 3.4.4.2.3.
Initial hold (min)
Final hold (min)   5.
I 1593.1563.1596.1569.1577.
ReferenceNovak, Langbehn, et al., 2002Palá-Paúl, Pérez-Alonso, et al., 2002Phutdhawong, Korth, et al., 2002Ruberto, Biondi, et al., 2002Schwob, Bessière, et al., 2002
Comment MSDC-RI MSDC-RI MSDC-RI MSDC-RI MSDC-RI
Column type CapillaryCapillaryCapillaryCapillaryCapillary
Active phase DB-1DB-1DB-1HP-5DB-5MS
Column length (m) 60.60.60.30.30.
Carrier gas HeHeHeH2He
Substrate
Column diameter (mm) 0.250.250.250.250.25
Phase thickness (μm)  0.250.250.250.25
Tstart (C) 40.40.40.40.60.
Tend (C) 250.280.280.280.270.
Heat rate (K/min) 4.4.4.4.3.
Initial hold (min)  5.5.
Final hold (min)
I 1562.1568.1569.1581.1581.
ReferenceSefidkon, Dabiri, et al., 2002Sefidkon, Jalili, et al., 2002Sefidkon, 2002Velickovic, Randjelovic, et al., 2002Zoghbi, Andrade, et al., 2002
Comment MSDC-RI MSDC-RI MSDC-RI MSDC-RI MSDC-RI
Column type CapillaryCapillaryCapillaryCapillaryCapillary
Active phase DB-5DB-1HP-5DB-5MSSPB-5
Column length (m) 30.60.30.30.60.
Carrier gas HeN2N2HeHe
Substrate
Column diameter (mm) 0.250.2480.250.250.32
Phase thickness (μm) 0.250.250.250.25
Tstart (C) 60.60.60.60.40.
Tend (C) 240.220.220.240.220.
Heat rate (K/min) 3.3.5.3.3.
Initial hold (min)  5.10. 5.
Final hold (min)  22.  15.
I 1581.1585.1583.1570.1588.
ReferenceZoghbi, Andrade, et al., 2002, 2Bailac, Dellacasa, et al., 2001Campeol, Flamini, et al., 2001Cherchi, Deidda, et al., 2001Cornu, Carnat, et al., 2001
Comment MSDC-RI MSDC-RI MSDC-RI MSDC-RI MSDC-RI
Column type CapillaryCapillaryCapillaryCapillaryCapillary
Active phase DB-1DB-1HP-5HP-5BP-1
Column length (m) 60.60.30.30.30.
Carrier gas HeHeN2N2N2
Substrate
Column diameter (mm) 0.250.250.250.250.25
Phase thickness (μm) 0.250.250.250.250.25
Tstart (C) 40.40.60.60.60.
Tend (C) 280.280.220.220.220.
Heat rate (K/min) 4.4.5.5.5.
Initial hold (min) 5.5.10.10.
Final hold (min)
I 1562.1570.1582.1582.1578.
ReferenceDabiri and Sefidkon, 2001Dabiri and Sefidkon, 2001Flamini, Cioni, et al., 2001Gallori, Flamini, et al., 2001Gupta, Mallavarapu, et al., 2001
Comment MSDC-RI MSDC-RI MSDC-RI MSDC-RI MSDC-RI
Column type CapillaryCapillaryCapillaryCapillaryCapillary
Active phase RTX-1CBP-1DB-5MSOV-101DB-5
Column length (m) 30.25.30.50.30.
Carrier gas N2NitrogenHeHeHe
Substrate
Column diameter (mm) 0.250.250.250.20.25
Phase thickness (μm) 0.250.250.250.50.25
Tstart (C) 60.50.60.50.60.
Tend (C) 300.210.240.250.270.
Heat rate (K/min) 4.3.3.2.3.
Initial hold (min)  2.
Final hold (min)   30.
I 1574.1582.1566.1562.1582.
ReferenceKalemba, Marschall, et al., 2001Ly, Yamauchi, et al., 2001Marongiu, Porcedda, et al., 2001Orav, Kailas, et al., 2001Palmeira, Conserva, et al., 2001
Comment MSDC-RI MSDC-RI MSDC-RI MSDC-RI MSDC-RI
Column type CapillaryCapillaryCapillaryCapillaryCapillary
Active phase DB-5DB-5DB-1DB-5DB-1
Column length (m) 30.30.30.30.30.
Carrier gas HeHeN2H2He
Substrate
Column diameter (mm) 0.250.250.250.250.2
Phase thickness (μm) 0.250.250.250.25
Tstart (C) 60.60.80.60.60.
Tend (C) 270.270.225.285.240.
Heat rate (K/min) 3.3.4.3.3.
Initial hold (min)
Final hold (min)
I 1585.1587.1550.1580.1578.5
ReferencePalmeira, Conserva, et al., 2001Palmeira, Conserva, et al., 2001Palá-Paúl, Pérez-Alonso, et al., 2001Santos-Gomes and Fernandes-Ferreira, 2001Santos, Moreira, et al., 2001
Comment MSDC-RI MSDC-RI MSDC-RI MSDC-RI MSDC-RI
Column type CapillaryCapillaryCapillaryCapillaryCapillary
Active phase PTE-5DB-5CP Sil 5 CBDB-1CP Sil 5 CB
Column length (m) 60.30.25.60.25.
Carrier gas H2He N2He
Substrate
Column diameter (mm) 0.320.250.250.250.25
Phase thickness (μm) 0.30.250.150.250.4
Tstart (C) 60.60.50.60.60.
Tend (C) 285.240.230.220.260.
Heat rate (K/min) 4.33.3.3.5.
Initial hold (min)    5.40.
Final hold (min)    22.
I 1581.1580.1586.1589.1569.
ReferenceStojanovic, Palic, et al., 2001Tellez M., Estell R., et al., 2001Asekun and Ekundayo, 2000Bailac, Dellacasa, et al., 2000Baser, Özek, et al., 2000
Comment MSDC-RI MSDC-RI MSDC-RI MSDC-RI MSDC-RI
Column type CapillaryCapillaryCapillaryCapillaryCapillary
Active phase SPB-1RSL-200HP-5DB-5DB-1
Column length (m) 30.60.30.30.25.
Carrier gas HeH2HeHeNitrogen
Substrate
Column diameter (mm) 0.20.320.250.250.50
Phase thickness (μm) 0.20.25 0.250.25
Tstart (C) 80.40.80.60.60.
Tend (C) 300.250.200.240.220.
Heat rate (K/min) 5.6.9.3.5.
Initial hold (min) 3.
Final hold (min)   10.
I 1582.1577.1581.1585.1576.
ReferenceFraternale, Giamperi, et al., 2000Jirovetz, Puschmann, et al., 2000Lis-Balchin and Roth, 2000Maia, Zoghbi, et al., 2000Mallavarapu, Rao, et al., 2000
Comment MSDC-RI MSDC-RI MSDC-RI MSDC-RI MSDC-RI
Column type CapillaryCapillaryCapillaryCapillaryCapillary
Active phase HP-1DB-5BP-1HP-5DB-5
Column length (m) 60.30.25.30.60.
Carrier gas HeN2N2HeHydrogen or helium (He2 wrote in original paper)
Substrate
Column diameter (mm) 0.250.220.330.250.25
Phase thickness (μm) 0.250.251.00.250.30
Tstart (C) 60.70.60.60.60.
Tend (C) 200.230.275.275.285.
Heat rate (K/min) 4.4.4.4.4.3
Initial hold (min) 5.2.
Final hold (min) 25.20.
I 1594.1568.1580.1577.1581.
ReferenceMeccia, Rojas, et al., 2000Mitiku, Sawamura, et al., 2000Mohagheghzadeh, Shams-Ardakani, et al., 2000Mohagheghzadeh, Shams-Ardakani, et al., 2000, 2Simic, Andjelkovic, et al., 2000
Comment MSDC-RI MSDC-RI MSDC-RI MSDC-RI MSDC-RI
Column type CapillaryCapillaryCapillaryCapillaryCapillary
Active phase OV-101DB-5CP Sil 5 CBOV-101DB-1
Column length (m) 50.30.25.25.60.
Carrier gas NitrogenHeH2N2N2
Substrate
Column diameter (mm) 0.250.250.250.250.25
Phase thickness (μm)  0.250.15 0.25
Tstart (C) 40.60.50.50.75.
Tend (C) 200.240.320.200.220.
Heat rate (K/min) 2.3.3.5.4.
Initial hold (min) 10.   1.
Final hold (min)     8.
I 1575.1581.1556.1577.1586.
ReferenceTamura, Boonbumrung, et al., 2000Tellez, Dayan, et al., 2000Asekun and Ekundayo, 1999Ayedoun, Adéoti, et al., 1999Bailac, Dellacasa, et al., 1999
Comment MSDC-RI MSDC-RI MSDC-RI MSDC-RI MSDC-RI
Column type CapillaryCapillaryCapillaryCapillaryCapillary
Active phase OV-101SE-30RTX-1OV-101OV-101
Column length (m) 52.30.30.25.50.
Carrier gas HeliumN2N2 N2
Substrate
Column diameter (mm) 0.260.250.250.320.2
Phase thickness (μm) 0.130.250.25
Tstart (C) 50.60.60.50.80.
Tend (C) 220.220.300.200.200.
Heat rate (K/min) 3.4.4.5.1.
Initial hold (min) 0.10.
Final hold (min) 0.   20.
I 1577.1568.1571.1576.1575.
ReferenceDzumayev, Tkachenko, et al., 1999Jassbi, Ahmad, et al., 1999Kalemba, 1999Kuiate, Zollo, et al., 1999Menon, Chacko, et al., 1999
Comment MSDC-RI MSDC-RI MSDC-RI MSDC-RI MSDC-RI
Column type CapillaryCapillaryCapillaryCapillaryCapillary
Active phase DB-5CP Sil 5 CBDB-1BP-1CP Sil 5 CB
Column length (m) 30.25.50.25.25.
Carrier gas HeHeHeN2He
Substrate
Column diameter (mm) 0.250.250.250.50.25
Phase thickness (μm)   0.25 0.39
Tstart (C) 40.50.70.60.60.
Tend (C) 230.230.240.220.220.
Heat rate (K/min) 4.3.4.5.5.
Initial hold (min) 1.   5.
Final hold (min)    10.20.
I 1580.1554.1551.1572.1574.
ReferenceMockute and Bernotiene, 1999Oyedeji, Olawore, et al., 1999Palá-Paúl, Pérez-Alonso, et al., 1999Rao, Bhattacharya, et al., 1999Rustaiyan, Masoudi, et al., 1999
Comment MSDC-RI MSDC-RI MSDC-RI MSDC-RI MSDC-RI
Column type CapillaryCapillaryCapillaryCapillaryCapillary
Active phase CP Sil 5 CBDB-1DB-5DB-1DB-5
Column length (m) 25.60.30.60.30.
Carrier gas N2HeHeHeHe
Substrate
Column diameter (mm) 0.250.250.250.250.25
Phase thickness (μm) 0.390.250.250.250.25
Tstart (C) 60.40.40.50.60.
Tend (C) 220.280.220.220.240.
Heat rate (K/min) 5.4.4.4.3.
Initial hold (min)  5.5.
Final hold (min)
I 1575.1578.1596.1585.1580.
ReferenceRustaiyan and Nadji, 1999Sefidkon, Dabiri, et al., 1999Sefidkon and Khajavi, 1999Sefidkon and Mirza, 1999Tellez, Canel, et al., 1999
Comment MSDC-RI MSDC-RI MSDC-RI MSDC-RI MSDC-RI
Column type CapillaryCapillaryCapillaryCapillaryCapillary
Active phase CP Sil 5 CBDB-5DB-5MSOV-101SPB-5
Column length (m) 25.30.30.50.50.
Carrier gas N2HeHeHeHe
Substrate
Column diameter (mm)  0.250.250.220.32
Phase thickness (μm) 0.390.250.251.0.25
Tstart (C) 60.60.60.100.60.
Tend (C) 220.240.240.220.240.
Heat rate (K/min) 5.3.3.1.3.
Initial hold (min)    1.
Final hold (min)     20.
I 1577.1581.1585.1576.1594.
ReferenceWeyerstahl, Marschall, et al., 1999Zoghbi, Andrade, et al., 1999Zoghbi, Andrade, et al., 1999, 2Camciuc, Bessière, et al., 1998Doneanu and Anitescu, 1998
Comment MSDC-RI MSDC-RI MSDC-RI MSDC-RI MSDC-RI
Column type CapillaryCapillaryCapillaryCapillaryCapillary
Active phase DB-5SE-30OV-1DB-5DB-5
Column length (m) 30.25.50.30.30.
Carrier gas HeHeHeHeHelium
Substrate
Column diameter (mm) 0.250.20.320.250.25
Phase thickness (μm) 0.25 0.250.250.25
Tstart (C) 60.60.50.60.60.
Tend (C) 240.180.250.240.240.
Heat rate (K/min) 3.3.10.3.3.
Initial hold (min)  10.5.
Final hold (min)   20.
I 1581.1574.1575.1584.1584.
ReferenceEl-Sakhawy, El-Tantawy, et al., 1998Jantan, Ahmad, et al., 1998Kökdil, Kurucu, et al., 1998Maia, Zohhbi, et al., 1998Santos, Andrade, et al., 1998
Comment MSDC-RI MSDC-RI MSDC-RI MSDC-RI MSDC-RI
Column type CapillaryCapillaryCapillaryCapillaryCapillary
Active phase OV-101OV-1OV-1OV-101DB-1
Column length (m) 25.30.30.30.
Carrier gas  He N2
Substrate
Column diameter (mm) 0.320.320.320.25
Phase thickness (μm)  0.250.25
Tstart (C) 50.40.40.100.80.
Tend (C) 200.270.270.220.220.
Heat rate (K/min) 5.2.2.5.6.
Initial hold (min)  4.4.
Final hold (min)
I 1578.1561.1561.1594.1561.
ReferenceZollo, Biyiti, et al., 1998Kökdil, Kurucu, et al., 1997Kökdil, Tanker, et al., 1997Menut, Lamaty, et al., 1997Salgueiro, Vila, et al., 1997
Comment MSDC-RI MSDC-RI MSDC-RI MSDC-RI MSDC-RI
Column type CapillaryCapillaryCapillaryCapillaryCapillary
Active phase DB-5DB-5CBP-1OV-101HP-1
Column length (m) 30.30.25.50.30.
Carrier gas HeliumHeHeN2N2
Substrate
Column diameter (mm) 0.250.250.220.250.53
Phase thickness (μm) 0.25  0.170.88
Tstart (C) 60.60.60.50.60.
Tend (C) 240.240.240.220.300.
Heat rate (K/min) 3.4.5.5.8.
Initial hold (min)
Final hold (min)     15.
I 1582.1585.1576.1572.1573.
ReferenceTellez, Estell, et al., 1997Zunino, Novillo-Newton, et al., 1997Zygadlo, Ariza-Espinar, et al., 1997Chacko, Jayalekshmy, et al., 1996Malizia, Molli, et al., 1996
Comment MSDC-RI MSDC-RI MSDC-RI MSDC-RI MSDC-RI
Column type CapillaryCapillaryCapillaryCapillaryCapillary
Active phase BP-1DB-1DB-1SPB-1DB-1
Column length (m) 25.60.60.50.60.
Carrier gas N2HeHeHeHe
Substrate
Column diameter (mm) 0.500.320.250.20.25
Phase thickness (μm)  0.500.250.330.25
Tstart (C) 60.50.50.40.50.
Tend (C) 220.250.250.200.250.
Heat rate (K/min) 5.8.2.53.3.5
Initial hold (min)  1.5.3.5.
Final hold (min)  6. 30.
I 1574.1577.1567.1570.1555.
ReferenceRajeswara, Kaul, et al., 1996Sagrero-Nieves and Bartley, 1996Stashenko, Puertas, et al., 1996Wong and Lai, 1996Stashenko, Torres, et al., 1995
Comment MSDC-RI MSDC-RI MSDC-RI MSDC-RI MSDC-RI
Column type CapillaryCapillaryCapillaryCapillaryCapillary
Active phase Methyl SiliconeMethyl SiliconeCP Sil 5 CBMethyl SiliconeOV-101
Column length (m) 50.50.25.25.50.
Carrier gas N2N2
Substrate
Column diameter (mm) 0.250.250.250.500.25
Phase thickness (μm) 0.170.17
Tstart (C) 80.80.60.60.80.
Tend (C) 200.200.280.220.200.
Heat rate (K/min) 2.3.5.5.2.
Initial hold (min)
Final hold (min)
I 1576.1570.1557.1576.1576.
ReferenceGopalakrishnan, Menon, et al., 1993Gopalakrishnan, Menon, et al., 1993Kaul, Singh, et al., 1993Mallavarapu, Ramesh, et al., 1993Tamura, Yang, et al., 1993
Comment MSDC-RI MSDC-RI MSDC-RI MSDC-RI MSDC-RI
Column type CapillaryCapillaryCapillaryCapillaryCapillary
Active phase OV-101DB-1DB-1BP-1OV-101
Column length (m) 50.30.60.25.50.
Carrier gas  N2  N2
Substrate
Column diameter (mm) 0.25 0.320.330.25
Phase thickness (μm)
Tstart (C) 80.80.50.45.80.
Tend (C) 200.220.230.180.200.
Heat rate (K/min) 2.4.4.3.2.
Initial hold (min)    3.
Final hold (min)   10.
I 1582.1557.1567.1561.1576.
ReferenceTamura, Yang, et al., 1993Velasco-Negueruela, Pérez Alonso, et al., 1991Binder, Benson, et al., 1990Wyllie, Brophy, et al., 1990Sugisawa, Yamamoto, et al., 1989
Comment MSDC-RI MSDC-RI MSDC-RI MSDC-RI MSDC-RI
Column type CapillaryCapillaryCapillaryCapillaryCapillary
Active phase OV-101OV-101OV-1OV-101OV-101
Column length (m) 50.50.50.50.50.
Carrier gas N2N2He
Substrate
Column diameter (mm) 0.250.250.200.300.30
Phase thickness (μm)   0.20
Tstart (C) 80.80.30.40.40.
Tend (C) 200.200.220.230.230.
Heat rate (K/min) 2.2.2.3.53.5
Initial hold (min)    5.5.
Final hold (min)
I 1573.1576.1565.1571.1601.
ReferenceSugisawa, Yang, et al., 1989Sugisawa, Yang, et al., 1989de Pooter, Nicolai, et al., 1988Nykanen, 1986Nykanen, 1986
Comment MSDC-RI MSDC-RI MSDC-RI MSDC-RI MSDC-RI
Column type Capillary
Active phase DB-1
Column length (m) 10.
Carrier gas H2
Substrate
Column diameter (mm) 0.25
Phase thickness (μm) 0.25
Tstart (C) 50.
Tend (C) 250.
Heat rate (K/min) 5.
Initial hold (min)
Final hold (min)
I 1568.
ReferencePerry, Baxter, et al., 1986
Comment MSDC-RI

Van Den Dool and Kratz RI, polar column, temperature ramp

Data compiled by: NIST Mass Spectrometry Data Center, William E. Wallace, director

Column type CapillaryCapillaryCapillaryCapillaryCapillary
Active phase RTX-WaxBP-20BP-20BP-20HP-Innowax
Column length (m) 60.50.50.50.30.
Carrier gas HeHeHeHeHe
Substrate
Column diameter (mm) 0.220.220.220.220.25
Phase thickness (μm) 0.250.250.250.250.25
Tstart (C) 60.60.60.60.60.
Tend (C) 230.220.220.220.280.
Heat rate (K/min) 2.2.2.2.3.
Initial hold (min)
Final hold (min) 30.20.20.20.
I 1980.1985.1990.1979.1989.
ReferenceBendahou, Muselli, et al., 2008Boti, Koukoua, et al., 2007Castilho, Liu, et al., 2007Duquesnoy, Castola, et al., 2007Kundakovic, Fokialakis, et al., 2007
Comment MSDC-RI MSDC-RI MSDC-RI MSDC-RI MSDC-RI
Column type CapillaryCapillaryCapillaryCapillaryCapillary
Active phase BP-20RTX-WaxRTX-WaxRTX-WaxBP-20
Column length (m) 50.60.60.60.50.
Carrier gas HeHeHeHe
Substrate
Column diameter (mm) 0.220.220.220.220.22
Phase thickness (μm) 0.250.250.250.250.25
Tstart (C) 60.60.60.60.60.
Tend (C) 220.230.230.230.220.
Heat rate (K/min) 2.2.2.2.2.
Initial hold (min)
Final hold (min) 20.30.35.35.20.
I 1982.1937.1960.1940.1987.
ReferenceLesueur, de Rocca Serra, et al., 2007Muselli, Rossi, et al., 2007Paolini J., Costa J., et al., 2007Paolini, Muselli, et al., 2007Blanc, Bradesi, et al., 2006
Comment MSDC-RI MSDC-RI MSDC-RI MSDC-RI MSDC-RI
Column type CapillaryCapillaryCapillaryCapillaryCapillary
Active phase BP-20BP-20RTX-WaxPolyethylene GlycolBP-20
Column length (m) 50.50.60.30.50.
Carrier gas HeHeHeN2He
Substrate
Column diameter (mm) 0.220.250.220.320.22
Phase thickness (μm) 0.250.250.250.250.25
Tstart (C) 60.60.60.50.60.
Tend (C) 220.220.230.230.220.
Heat rate (K/min) 2.2.2.2.2.
Initial hold (min)    10.
Final hold (min) 20.20.45.15.20.
I 1989.1985.1976.2001.1981.
ReferenceBoti, Bighelli, et al., 2006Bousmaha, Boti, et al., 2006Cavalli, Tomi, et al., 2006Dob, Dahmane, et al., 2006Duquesnoy, Dinh, et al., 2006
Comment MSDC-RI MSDC-RI MSDC-RI MSDC-RI MSDC-RI
Column type CapillaryCapillaryCapillaryCapillaryCapillary
Active phase HP-WaxBP-20DB-WaxSupelcowax-10PEG-20M
Column length (m) 30.50.60.30.25.
Carrier gas N2HeHeHeHe
Substrate
Column diameter (mm) 0.250.220.320.20.25
Phase thickness (μm) 0.250.250.250.20.3
Tstart (C) 60.60.35.70.50.
Tend (C) 220.220.220.220.220.
Heat rate (K/min) 5.2.3.3.3.
Initial hold (min) 10.   1.
Final hold (min)  20. 15.5.
I 1966.1987.1988.1968.1965.
ReferenceFlamini, Tebano, et al., 2006Gonny, Cavaleiro, et al., 2006Pala-Paul, Copeland, et al., 2006Pinto, Pina-Vaz, et al., 2006Rubiolo P., Matteodo M., et al., 2006
Comment MSDC-RI MSDC-RI MSDC-RI MSDC-RI MSDC-RI
Column type CapillaryCapillaryCapillaryCapillaryCapillary
Active phase Supelcowax-10FFAPBP-20DB-WaxRTX-Wax
Column length (m) 30.20.50.60.60.
Carrier gas HeHeHeN2
Substrate
Column diameter (mm) 0.20.250.220.250.22
Phase thickness (μm) 0.20.250.250.250.25
Tstart (C) 70.90.60.70.60.
Tend (C) 220.220.220.230.220.
Heat rate (K/min) 3.4.2.2.2.
Initial hold (min)  2. 2.
Final hold (min) 15. 20.20.20.
I 1968.2036.1986.1990.1964.
ReferenceSalgueiro L.R., Pinto E., et al., 2006Agnihotri, Agarwal, et al., 2005Boti J.B., Koukoua G., et al., 2005Choi, 2005Cozzani, Muselli, et al., 2005
Comment MSDC-RI MSDC-RI MSDC-RI MSDC-RI MSDC-RI
Column type CapillaryCapillaryCapillaryCapillaryCapillary
Active phase DB-WaxRTX-WaxPEG-20MBP-20DB-Wax
Column length (m) 60.60. 50.30.
Carrier gas N2He HeN2
Substrate
Column diameter (mm) 0.250.22 0.220.25
Phase thickness (μm) 0.250.25 0.250.25
Tstart (C) 70.60.50.60.60.
Tend (C) 230.230.250.230.220.
Heat rate (K/min) 2.2.4.2.5.
Initial hold (min) 2.   10.
Final hold (min) 20.35. 35.
I 2001.1960.1987.1983.1967.
ReferenceNjoroge, Koaze, et al., 2005Paolini, Costa, et al., 2005Simionatto, Porto, et al., 2005Vellutini, Baldovini, et al., 2005Bertoli, Menichini, et al., 2004
Comment MSDC-RI MSDC-RI MSDC-RI MSDC-RI MSDC-RI
Column type CapillaryCapillaryCapillaryCapillaryCapillary
Active phase DB-WaxSupelcowax-10HP-WaxBP-20BP-20
Column length (m) 60.30.30.50.50.
Carrier gas HeHeN2 He
Substrate
Column diameter (mm) 0.320.20.250.220.22
Phase thickness (μm) 0.250.20.250.250.25
Tstart (C) 32.70.60.60.60.
Tend (C) 220.220.220.220.220.
Heat rate (K/min) 3.3.5.2.2.
Initial hold (min)   10.
Final hold (min)  15. 20.20.
I 1988.1969.1966.1980.1979.
ReferenceBrophy, Goldsack, et al., 2004Cavaleiro, Salgueiro, et al., 2004Flamini, Luigi Cioni, et al., 2004Gonny, Bradesi, et al., 2004Tam, Thuam, et al., 2004
Comment MSDC-RI MSDC-RI MSDC-RI MSDC-RI MSDC-RI
Column type CapillaryCapillaryCapillaryCapillaryCapillary
Active phase HP-WaxCarbowax 20MRTX-WaxSupelcowaxSupelcowax
Column length (m) 30.25.60.25.25.
Carrier gas N2HeHe
Substrate
Column diameter (mm) 0.250.250.220.250.25
Phase thickness (μm) 0.250.30.250.250.25
Tstart (C) 60.50.60.35.35.
Tend (C) 220.200.230.225.225.
Heat rate (K/min) 5.3.2.4.4.
Initial hold (min) 10.1. 5.5.
Final hold (min)  20.45.10.10.
I 1966.1972.1978.2023.2023.
ReferenceBader, Caponi, et al., 2003Bicchi, Rubiolo, et al., 2003Cavalli, Tomi, et al., 2003Chisholm, Wilson, et al., 2003Chisholm, Wilson, et al., 2003
Comment MSDC-RI MSDC-RI MSDC-RI MSDC-RI MSDC-RI
Column type CapillaryCapillaryCapillaryCapillaryCapillary
Active phase SupelcowaxSupelcowaxDB-WaxHP-20MHP-Innowax
Column length (m) 25.25.60.50.30.
Carrier gas   N2HeHe
Substrate
Column diameter (mm) 0.250.250.250.20.25
Phase thickness (μm) 0.250.250.250.20.5
Tstart (C) 35.35.70.70.60.
Tend (C) 225.225.230.180.260.
Heat rate (K/min) 4.4.2.4.3.
Initial hold (min) 5.5.2.4.
Final hold (min) 10.10.20.10.
I 2016.2019.1999.1944.1966.
ReferenceChisholm, Wilson, et al., 2003Chisholm, Wilson, et al., 2003Choi, 2003Jerkovic, Mastelic, et al., 2003Skaltsa, Demetzos, et al., 2003
Comment MSDC-RI MSDC-RI MSDC-RI MSDC-RI MSDC-RI
Column type CapillaryCapillaryCapillaryCapillaryCapillary
Active phase HP-InnowaxDB-WaxInnowaxBP-20RTX-Wax
Column length (m) 30.60.30.50.30.
Carrier gas HeN2HeHeHe
Substrate
Column diameter (mm) 0.250.250.250.220.25
Phase thickness (μm) 0.50.250.50.250.25
Tstart (C) 60.70.60.60.45.
Tend (C) 260.230.260.220.250.
Heat rate (K/min) 3.2.3.2.3.
Initial hold (min)     6.
Final hold (min)  20.10.20.10.
I 1966.1985.1983.1974.1938.
ReferenceSkaltsa, Demetzos, et al., 2003Choi, Kim. M.-S.L., et al., 2002Couladis, Chinou, et al., 2002Lota, de Rocca Serra, et al., 2002Mondello, Zappia, et al., 2002
Comment MSDC-RI MSDC-RI MSDC-RI MSDC-RI MSDC-RI
Column type CapillaryCapillaryCapillaryCapillaryCapillary
Active phase AT-WaxHP-InnowaxCP-Wax 52CBAT-WaxBP-20
Column length (m) 60.30.50.60.50.
Carrier gas HeHe HeHe
Substrate
Column diameter (mm) 0.320.250.250.320.22
Phase thickness (μm) 0.250.500.20.250.25
Tstart (C) 65.60.32.65.60.
Tend (C) 250.260.220.250.220.
Heat rate (K/min) 2.3.1.2.2.
Initial hold (min) 10. 1.10.
Final hold (min) 60.10. 60.20.
I 1954.2000.1969.1954.1972.
ReferencePino, Marbot, et al., 2002Couladis, Baziou, et al., 2001Kjeldsen, Christensen, et al., 2001Pino, Marbot, et al., 2001Rezzi, Bighelli, et al., 2001
Comment MSDC-RI MSDC-RI MSDC-RI MSDC-RI MSDC-RI
Column type CapillaryCapillaryCapillaryCapillaryCapillary
Active phase DB-WaxDB-WaxDB-WaxCP-Wax 52CBCP-Wax 52CB
Column length (m) 60.60.60.25.25.
Carrier gas HeHeHe
Substrate
Column diameter (mm) 0.500.530.530.250.25
Phase thickness (μm) 1.01.01.00.150.15
Tstart (C) 60.50.50.40.40.
Tend (C) 225.220.220.220.220.
Heat rate (K/min) 3.3.3.3.3.
Initial hold (min)    5.5.
Final hold (min)
I 1983.1983.1938.1965.1984.
ReferenceBrophy, Goldsack, et al., 2000Brophy, Goldsack, et al., 2000, 2Brophy, Goldsack, et al., 2000, 3Chagonda, Makanda, et al., 2000Chagonda, Makanda, et al., 2000
Comment MSDC-RI MSDC-RI MSDC-RI MSDC-RI MSDC-RI
Column type CapillaryCapillaryCapillaryCapillaryCapillary
Active phase DB-WaxDB-WaxSupelcowax-10DB-WaxDB-Wax
Column length (m) 60.30.30.60.60.
Carrier gas N2HeHeHeHe
Substrate
Column diameter (mm) 0.250.250.320.530.53
Phase thickness (μm) 0.250.250.25
Tstart (C) 70.40.75.50.50.
Tend (C) 230.200.200.220.220.
Heat rate (K/min) 2.2.2.53.3.
Initial hold (min) 2.5.
Final hold (min) 20.20.
I 2001.1955.1969.1983.1983.
ReferenceChoi and Sawamura, 2000Kim, Thuy, et al., 2000Lazari, Skaltsa, et al., 2000Brophy, Goldsack, et al., 1999Brophy, Goldsack, et al., 1999, 2
Comment MSDC-RI MSDC-RI MSDC-RI MSDC-RI MSDC-RI
Column type CapillaryCapillaryCapillaryCapillaryCapillary
Active phase HP-InnowaxBP-20BP-20Carbowax 20MSP-1000
Column length (m) 60.50.50.25.85.
Carrier gas HeHeHeH2He
Substrate
Column diameter (mm) 0.250.220.220.250.5
Phase thickness (μm)  0.250.250.3
Tstart (C) 32.60.60.50.60.
Tend (C) 220.230.220.200.225.
Heat rate (K/min) 2.2.2.3.3.
Initial hold (min) 1.  1.
Final hold (min) 40.35.20.20.
I 1985.1974.1979.1968.1983.
ReferenceChristensen, Jakobsen, et al., 1999Lota, Serra, et al., 1999Mazzoni, Tomi, et al., 1999Bicchi, Rubiolo, et al., 1998Brophy, Forster, et al., 1998
Comment MSDC-RI MSDC-RI MSDC-RI MSDC-RI MSDC-RI
Column type CapillaryCapillaryCapillaryCapillaryCapillary
Active phase DB-WaxDB-WaxCarbowax 20MDB-WaxSP-1000
Column length (m) 60.60.25.60.85.
Carrier gas HeHe HeHe
Substrate
Column diameter (mm) 0.320.320.250.320.5
Phase thickness (μm)   0.3
Tstart (C) 65.35.50.65.65.
Tend (C) 225.220.200.225.225.
Heat rate (K/min) 3.3.3.3.3.
Initial hold (min)   1.
Final hold (min)   20.
I 1983.1983.1965.1983.1983.
ReferenceBrophy, Goldsack, et al., 1998Brophy, Goldsack, et al., 1998, 2Bicchi, Fresia, et al., 1997Brophy, Goldsack, et al., 1997Brophy, Goldsack, et al., 1997, 2
Comment MSDC-RI MSDC-RI MSDC-RI MSDC-RI MSDC-RI
Column type CapillaryCapillaryCapillaryCapillaryCapillary
Active phase BP-20BP-20DB-WaxDB-WaxCarbowax 20M
Column length (m) 50.50.25.60.50.
Carrier gas HeHeHeHeHe
Substrate
Column diameter (mm) 0.220.220.250.250.2
Phase thickness (μm) 0.250.250.250.250.2
Tstart (C) 60.60.50.50.30.
Tend (C) 230.230.240.180.170.
Heat rate (K/min) 2.2.4.2.54.
Initial hold (min)   3.5.2.
Final hold (min) 35.35.  20.
I 1974.1974.1961.2005.1981.
ReferenceMariotti, Costa, et al., 1997Mariotti, Tomi, et al., 1997Möllenbeck, König, et al., 1997Stashenko, Prada, et al., 1996Píry, Príbela, et al., 1995
Comment MSDC-RI MSDC-RI MSDC-RI MSDC-RI MSDC-RI
Column type CapillaryCapillaryCapillaryCapillaryCapillary
Active phase HP-20MDB-WaxCarbowax 20MCarbowax 20MCarbowax 20M
Column length (m) 50.30.60.60.60.
Carrier gas HeHeHe
Substrate
Column diameter (mm) 0.250.320.320.320.32
Phase thickness (μm)  0.5 0.250.25
Tstart (C) 60.40.50.40.40.
Tend (C) 190.220.225.230.230.
Heat rate (K/min) 3.3.1.5
Initial hold (min)
Final hold (min)   80.
I 1962.1975.1993.1971.1983.
ReferenceChung, Eiserich, et al., 1993Le Quere and Latrasse, 1990Chen and Ho, 1988Peppard and Ramus, 1988Peppard and Ramus, 1988
Comment MSDC-RI MSDC-RI MSDC-RI MSDC-RI MSDC-RI
Column type CapillaryCapillary
Active phase Carbowax 20MCarbowax 20M
Column length (m) 60.60.
Carrier gas
Substrate
Column diameter (mm) 0.320.32
Phase thickness (μm) 0.250.25
Tstart (C) 40.40.
Tend (C) 230.230.
Heat rate (K/min)
Initial hold (min)
Final hold (min)
I 1984.1985.
ReferencePeppard and Ramus, 1988Peppard and Ramus, 1988
Comment MSDC-RI MSDC-RI

References

Andrade, Sampaio, et al., 2007
Andrade, M.S.; Sampaio, T.S.; Nogueira, P.C.L.; Ribeiro, A.S.; Bittrich, V.; Amaral, M.C.E., Volatile compounds of the leaves, flowers and fruits of Kielmeyera rugosa Choisy (Clusiaceae), Flavour Fragr. J., 2007, 22, 1, 49-52, https://doi.org/10.1002/ffj.1751 . [all data]

Bruni, Bianchi, et al., 2007
Bruni, R.; Bianchi, A.; Bellardi, M.G., Essential oil composition of Agastache anethiodora Britton (Lamiaceae) infected by cucumber mosaic virus (CMV), Flavour Fragr. J., 2007, 22, 1, 66-70, https://doi.org/10.1002/ffj.1760 . [all data]

Eyres, Marriott, et al., 2007
Eyres, G.T.; Marriott, P.J.; Dufour, J.-P., Comparison of Odor-Active Compounds in the Spicy Fraction of Hop (Humulus lupulus L.) Essential Oil from Four Different Varieties, J. Agric. Food Chem., 2007, 55, 15, 6252-6261, https://doi.org/10.1021/jf070739t . [all data]

Sant'Anna, Fontes, et al., 2007
Sant'Anna, B.M.P.; Fontes, S.P.; Pinto, A.C.; Rezende, C.M., Characterization of woody odorant contributors in copaiba oil (Copaifera multijuga Hayne), J. Braz. Chem. Soc., 2007, 18, 5, 984-989, https://doi.org/10.1590/S0103-50532007000500016 . [all data]

Carasek and Pawliszyn, 2006
Carasek, E.; Pawliszyn, J., Screening of Tropical Fruit Volatile Compounds Using Solid-Phase Microextraction (SPME) Fibers and Internally Cooled SPME Fiber, J. Agric. Food Chem., 2006, 54, 23, 8688-8696, https://doi.org/10.1021/jf0613942 . [all data]

Cardeal, da Silva, et al., 2006
Cardeal, Z.L.; da Silva, M.D.R.G.; Marriott, P.J., Comprehensive two-dimensional gas chromatography/mass spectrometric analysis of pepper volatiles, Rapid Commun. Mass Spectrom., 2006, 20, 19, 2823-2836, https://doi.org/10.1002/rcm.2665 . [all data]

Eom S.H., Yang H.S., et al., 2006
Eom S.H.; Yang H.S.; Weston L.A., An evaluation of the allelopathic potential of selected perennial groundcovers: Foliar volatiles of catmint (Nepeta x faassenii) inhibit seedling growth, J. Chem. Ecol., 2006, 32, 8, 1835-1848, https://doi.org/10.1007/s10886-006-9112-1 . [all data]

Moon, Cliff, et al., 2006
Moon, S.-Y.; Cliff, M.A.; Li-Chan, E.C.Y., Odour-active components of simulated beef flavour analysed by solid phase microextraction and gas chromatography-mass spectrometry and -olfactometry, Food Res. Int., 2006, 39, 3, 294-308, https://doi.org/10.1016/j.foodres.2005.08.002 . [all data]

Özel, Gögüs, et al., 2006
Özel, M.Z.; Gögüs, F.; Lewis, A.C., Determination of Teucrium chamaedrys volatiles by using direct thermal desorption-comprehensive two-dimensional gas chromatography-time-of-flight mass spectrometry, J. Chromatogr. A, 2006, 1114, 1, 164-169, https://doi.org/10.1016/j.chroma.2006.02.036 . [all data]

Sacchetti, Guerrini, et al., 2006
Sacchetti, G.; Guerrini, A.; Noriega, P.; Bianchi, A.; Bruni, R., Essential oil of wild Ocotea quixos (Lam.) Kosterm. (Lauraceae) leaves from Amazonian Ecuador, Flavour Fragr. J., 2006, 21, 4, 674-676, https://doi.org/10.1002/ffj.1648 . [all data]

Akpulat, Tepe, et al., 2005
Akpulat, H.A.; Tepe, B.; Sokmen, A.; Daferera, D.; Polissiou, M., Composition of the essential oils of Tanacetum argyrophyllum (C. Koch) Tvzel. var. argyrophyllum and Tanacetum parthenium (L.) Schultz Bip. (Asteraceae) from Turkey, Biochem. Syst. Ecol., 2005, 33, 5, 511-516, https://doi.org/10.1016/j.bse.2004.10.006 . [all data]

Bruni, Pellati, et al., 2005
Bruni, R.; Pellati, F.; Grazia Bellardi, M.; Benvenuti, S.; Paltrinieri, S.; Bertaccini, A.; Bianchi, A., Herbal drug quality and phytochemical composition of Hypericum perforatum L. affected by ash yellows phytoplasma infection, J. Agric. Food Chem., 2005, 53, 4, 964-968, https://doi.org/10.1021/jf0487654 . [all data]

Lorenzo, Paz, et al., 2005
Lorenzo, D.; Paz, D.; Davies, P.; Villamil, J.; Vila, R.; Canigueral, S.; Dellacassa, E., Application of Multidimensional Gas Chromatography to the Enantioselective Characterisation of the Essential Oil of Eupatorium buniifolium Hooker et Arnott, Phytochem. Anal., 2005, 16, 1, 39-44, https://doi.org/10.1002/pca.808 . [all data]

Oliveira, Campos, et al., 2005
Oliveira, M.J.; Campos, I.F.P.; Oliveira, C.B.A.; Santos, M.R.; Souza, P.S.; Santos, S.C.; Seraphin, J.C.; Ferri, P.H., Influence of growth phase on the essential oil composition of Hyptis suaveolens, Biochem. Syst. Ecol., 2005, 33, 3, 275-285, https://doi.org/10.1016/j.bse.2004.10.001 . [all data]

Sacchetti, Maietti, et al., 2005
Sacchetti, G.; Maietti, S.; Muzzoli, M.; Scaglianti, M.; Manfredini, S.; Radice, M.; Bruni, R., Comparative evaluation of 11 essential oils of different origin as functional antioxidants, antiradicals and antimicrobials in foods, Food Chem., 2005, 91, 4, 621-632, https://doi.org/10.1016/j.foodchem.2004.06.031 . [all data]

Helmig, Bocquet, et al., 2004
Helmig, D.; Bocquet, F.; Pollmann, J.; Revermann, T., Analytical techniques for sesquiterpene emission rate studies in vegetation enclosure experiments, Atmos. Environ., 2004, 38, 4, 557-572, https://doi.org/10.1016/j.atmosenv.2003.10.012 . [all data]

Sacchetti, Medici, et al., 2004
Sacchetti, G.; Medici, A.; Maietti, S.; Radice, M.; Muzzoli, M.; Manfredini, S.; Braccioli, E.; Bruni, R., Composition and functional properties of the essential oil of Amazonian basil, Ocimum micranthum Willd., Labiatae in comparison with commercial essential oils, J. Agric. Food Chem., 2004, 52, 11, 3486-3491, https://doi.org/10.1021/jf035145e . [all data]

Mockute and Judzentiene, 2003
Mockute, D.; Judzentiene, A., Variability of the essential oils composition of Achillea millefolium ssp. millefolium growing wild in Lithuania, Biochem. Syst. Ecol., 2003, 31, 9, 1033-1045, https://doi.org/10.1016/S0305-1978(03)00066-8 . [all data]

Passos X.S., Castro A.C.M., et al., 2003
Passos X.S.; Castro A.C.M.; Pires J.S.; Garcia A.C.F.; Campos F.C.; Fernandes O.F.L.; Paula J.R.; Ferreira H.D.; Santos S.C.; Ferri P.H.; Silva M.D.R., Composition and antifungal activity of the essential oils of Caryocar brasiliensis, Pharm. Biol., 2003, 41, 5, 319-324, https://doi.org/10.1076/phbi.41.5.319.15936 . [all data]

Azevedo, Campos, et al., 2002
Azevedo, N.R.; Campos, I.F.P.; Ferreira, H.D.; Portes, T.A.; Seraphin, J.C.; de Paula, J.R.; Santos, S.C.; Ferri, P.H., Essential oil chemotypes in Hyptis suaveolens from Brazilian Cerrado, Biochem. Syst. Ecol., 2002, 30, 3, 205-216, https://doi.org/10.1016/S0305-1978(01)00075-8 . [all data]

García, Alvarez, et al., 2002
García, D.; Alvarez, A.; Tornos, P.; Fernandez, A.; Sáenz, T., Gas chromatographic-mass spectrometry study of the essential oils of Pimenta racemosa var. terebinthina and P. racemosa var. grisea, Z. Naturforsch., 2002, 57c, 449-451. [all data]

Lorenzo, Paz, et al., 2002
Lorenzo, D.; Paz, D.; Dellacassa, E.; Davies, P.; Vila, R.; Cañigueral, S., Essential oils of Mentha pulegium and Mentha rotundifolia from Uruguay, Braz. Arch. Biol. Technol., 2002, 45, 4, 519-524, https://doi.org/10.1590/S1516-89132002000600016 . [all data]

Cavalli, Ranarivelo, et al., 2001
Cavalli, J.-F.; Ranarivelo, L.; Ratsimbason, M.; Bernardini, A.-F.; Casanova, J., Constituents of the essential oil of six Helichrysum species from Madagascar, Flavour Fragr. J., 2001, 16, 4, 253-256, https://doi.org/10.1002/ffj.994 . [all data]

Lorenzo, Dellacassa, et al., 2001
Lorenzo, D.; Dellacassa, E.; Bonaccorsi, I.; Mondello, L., Uruguayan essential oils. Composition of leaf oil of Myrcianthes cisplatensis (Camb.) Berg. ('Guayabo colorado') (Myrtaceae), Flavour Fragr. J., 2001, 16, 2, 97-99, https://doi.org/10.1002/1099-1026(200103/04)16:2<97::AID-FFJ952>3.0.CO;2-C . [all data]

Lorenzo, Paz, et al., 2001
Lorenzo, D.; Paz, D.; Davies, P.; Vila, R.; Canigueral, S.; Dellacassa, E., Composition of a new essential oil type of Lippia alba (Mill.) N.E. Brown from Uruguay, Flavour Fragr. J., 2001, 16, 5, 356-359, https://doi.org/10.1002/ffj.1011 . [all data]

Isidorov, Krajewska, et al., 2000
Isidorov, V.; Krajewska, U.; Bal, K.; Jaroszynska, J.; Niesluchowska, A.; Fuksman, I., GC-MS identification of multicomponent organic compounds mixtures using extra column phase equilibrium, Chem. Anal. (Warsaw), 2000, 45, 513-520. [all data]