Cyclohexanone, 3,5-di-tert-butyl-, cis

Reaction thermochemistry data

Data compiled by: Hussein Y. Afeefy, Joel F. Liebman, and Stephen E. Stein

Individual Reactions

3,5-Di-tert-butylcyclohexanone = Cyclohexanone, 3,5-di-tert-butyl-, cis

By formula: C14H26O = C14H26O

Quantity Value Units Method Reference Comment
Δr-3.91 ± 0.10kcal/molEqkAllinger and Karkowski, 1965liquid phase; GC

References

Allinger and Karkowski, 1965
Allinger, N.L.; Karkowski, F.M., The energy of the boat form of a simple cyclohexanone, Tetrahedron Lett., 1965, 2171-2174. [all data]