Benzenamine, N-(phenylmethylene)-, N-oxide

Gas phase thermochemistry data

Data compiled by: Hussein Y. Afeefy, Joel F. Liebman, and Stephen E. Stein

Quantity Value Units Method Reference Comment
Δfgas263.0 ± 2.1kJ/molCcbKirchner, Acree, et al., 1986

Condensed phase thermochemistry data

Data compiled by: Hussein Y. Afeefy, Joel F. Liebman, and Stephen E. Stein

Quantity Value Units Method Reference Comment
Δfsolid148.0 ± 2.0kJ/molCcbKirchner, Acree, et al., 1986
Quantity Value Units Method Reference Comment
Δcsolid-6835.7 ± 1.0kJ/molCcbKirchner, Acree, et al., 1986

References

Kirchner, Acree, et al., 1986
Kirchner, J.J.; Acree, W.E., Jr.; Pilcher, G.; Shaofeng, L., Enthalpies of combustion of four N-phenylmethylene benzenamine N-oxide derivatives, of N-phenylmethylene benzenamine, and of trans-diphenyldiazene N-oxide: the dissociation enthalpy of the (N-O)bonds, J. Chem. Thermodyn., 1986, 18, 793-799. [all data]