4-Chlorobenzylidene-4'-propylaniline

Phase change data

Data compiled by: William E. Acree, Jr., James S. Chickos

Enthalpy of fusion

ΔfusH (kJ/mol) Temperature (K) Method Reference
24.61343.7DSCGalewski and Coles, 1999

References

Galewski and Coles, 1999
Galewski, Z.; Coles, H.J., Liquid crystalline properties and phase situations in 4-chlorobenzylidene-4´-alkylanilines, Journal of Molecular Liquids, 1999, 79, 1, 77-87, https://doi.org/10.1016/S0167-7322(98)00104-4 . [all data]