Chlorprothixene

Van Den Dool and Kratz RI, non-polar column, temperature ramp

Data compiled by: NIST Mass Spectrometry Data Center, William E. Wallace, director

Column type CapillaryCapillary
Active phase CBP-1SE-30
Column length (m) 12.15.
Carrier gas N2He
Substrate
Column diameter (mm) 0.530.25
Phase thickness (μm)  0.25
Tstart (C) 120.100.
Tend (C) 250.295.
Heat rate (K/min) 6.5.
Initial hold (min)
Final hold (min)
I 2452.2460.
ReferenceOyama, Sano, et al., 1987Anderson and Stafford, 1983
Comment MSDC-RI MSDC-RI

Phase change data

Data compiled as indicated in comments:
TRC - Thermodynamics Research Center, NIST Boulder Laboratories, Chris Muzny director
AC - William E. Acree, Jr., James S. Chickos
DH - Eugene S. Domalski and Elizabeth D. Hearing

Quantity Value Units Method Reference Comment
Tfus370.3KN/AChauvet and Masse, 1983Uncertainty assigned by TRC = 0.2 K; TRC

Enthalpy of fusion

ΔfusH (kcal/mol) Temperature (K) Method Reference Comment
6.649370.3N/ADomalski and Hearing, 1996AC
6.6491370.3N/AChauvet and Masse, 1983, 2DH
6.91370.5DTAMasse and Chauvet, 1983AC

Entropy of fusion

ΔfusS (cal/mol*K) Temperature (K) Reference Comment
17.9370.3Chauvet and Masse, 1983, 2DH

In addition to the Thermodynamics Research Center (TRC) data available from this site, much more physical and chemical property data is available from the following TRC products:

Gas phase ion energetics data

Data compiled by: Henry M. Rosenstock, Keith Draxl, Bruce W. Steiner, and John T. Herron

Ionization energy determinations

IE (eV) Method Reference
7.68 ± 0.03CTSFulton and Lyons, 1968

Kovats' RI, non-polar column, isothermal

View large format table.

Column type Active phase Temperature (C) I Reference Comment
PackedSE-30240.2481.Musumarra, Scarlata, et al., 1987N2, 1% se-30 on Anachrom ABS(80-100mesh); Column length: 2. m

Normal alkane RI, non-polar column, isothermal

View large format table.

Column type Active phase Temperature (C) I Reference Comment
PackedOV-101200.2501.Dubsky, Hána, et al., 1978Nitrogen, Chromosorb G (100-120 mesh); Column length: 2. m

Normal alkane RI, non-polar column, temperature ramp

View large format table.

Column type Active phase I Reference Comment
PackedSE-302487.MHA, 9999Nitrogen, Chromosorb G AW DMCS (80-100 mesh); Column length: 2. m; Tstart: 100. C; Tend: 300. C
PackedOV-1012510.Maurer and Pfleger, 1984N2, Chromosorb G HP, 20. K/min, 310. C @ 3. min; Column length: 0.6 m; Tstart: 100. C
PackedOV-12450.Marozzi, Gambaro, et al., 1982Gas Chrom P, 5. K/min; Column length: 2. m; Tstart: 150. C; Tend: 300. C

Normal alkane RI, non-polar column, custom temperature program

View large format table.

Column type Active phase I Reference Comment
OtherMethyl Silicone2487.Ardrey and Moffat, 1981Program: not specified
PackedOV-1012510.Dubsky, Hána, et al., 1978Nitrogen, Chromosorb G (100-120 mesh); Column length: 2. m; Program: not specified

References

Oyama, Sano, et al., 1987
Oyama, N.; Sano, T.; Syoyama, M.; Maeda, K., Studies on systematic analysis of poisonous compounds in forensic chemistry. II. Application of capillary column gas chromatography to substance identification by means of retention indices, Eisei Kagaku, 1987, 33, 5, 342-348, https://doi.org/10.1248/jhs1956.33.342 . [all data]

Anderson and Stafford, 1983
Anderson, W.H.; Stafford, D.T., Applications of capillary gas chromatography in routine toxicological analyses, J. Hi. Res. Chromatogr. Chromatogr. Comm., 1983, 6, 5, 247-254, https://doi.org/10.1002/jhrc.1240060506 . [all data]