Dimethyl(8-mercaptoquino)gold

Phase change data

Data compiled by: William E. Acree, Jr., James S. Chickos

Enthalpy of sublimation

ΔsubH (kJ/mol) Temperature (K) Method Reference
120.5 ± 1.7359. - 418.MEMorozova, Zherikova, et al., 2008

References

Morozova, Zherikova, et al., 2008
Morozova, Natalia B.; Zherikova, Ksenia V.; Baidina, Iraida A.; Sysoev, Sergei V.; Semyannikov, Pyotr P.; Yakovkina, Lyubov' V.; Smirnova, Tamara P.; Gelfond, Nikolay V.; Igumenov, Igor K.; Carta, Giovanni; Rossetto, Gilberto, Volatile hafnium(IV) compounds with beta-diketonate and cyclopentadienyl derivatives, Journal of Physics and Chemistry of Solids, 2008, 69, 2-3, 673-679, https://doi.org/10.1016/j.jpcs.2007.07.057 . [all data]