2,2'-Bipyridine, 4,4'-dimethyl-

Gas phase thermochemistry data

Data compiled by: Hussein Y. Afeefy, Joel F. Liebman, and Stephen E. Stein

Quantity Value Units Method Reference Comment
Δfgas209.3 ± 4.1kJ/molCcbRibeiro da Silva, Matos, et al., 1997

Condensed phase thermochemistry data

Data compiled by: Hussein Y. Afeefy, Joel F. Liebman, and Stephen E. Stein

Quantity Value Units Method Reference Comment
Δfsolid109.6 ± 3.4kJ/molCcbRibeiro da Silva, Matos, et al., 1997
Quantity Value Units Method Reference Comment
Δcsolid-6546.7 ± 3.0kJ/molCcbRibeiro da Silva, Matos, et al., 1997

Phase change data

Data compiled as indicated in comments:
ALS - Hussein Y. Afeefy, Joel F. Liebman, and Stephen E. Stein
AC - William E. Acree, Jr., James S. Chickos
DRB - Donald R. Burgess, Jr.

Quantity Value Units Method Reference Comment
Δsub99.7 ± 2.3kJ/molCRibeiro da Silva, Matos, et al., 1997ALS
Δsub99.7 ± 2.3kJ/molCRibeiro da Silva, Matos, et al., 1997, 2AC
Δsub99.7kJ/molN/AN/ADRB

References

Ribeiro da Silva, Matos, et al., 1997
Ribeiro da Silva, M.A.V.; Matos, M.A.R.; do Rio, C.M.A.; Morais, V.M.F., Thermochemical and theoretical studies of 4-methylbiphenyl, 4,4'-dimethylbiphenyl, 4,4'-dimethyl-2,2'-bipyridine, J. Chem. Soc. Farad. Trans, 1997, 93, 3061. [all data]

Ribeiro da Silva, Matos, et al., 1997, 2
Ribeiro da Silva, Manuel A.V.; Matos, Agostinha R.; do Rio, Carolina M.A.; Morais, Victor M.F., Thermochemical and theoretical studies of 4-methylbiphenyl, 4,4´-dimethylbiphenyl, 4,4´-dimethyl-2,2´-bipyridine, Faraday Trans., 1997, 93, 17, 3061-3065, https://doi.org/10.1039/a701769c . [all data]