Benzene, 1,1'-selenobis-

Phase change data

Data compiled by: William E. Acree, Jr., James S. Chickos

Enthalpy of vaporization

ΔvapH (kJ/mol) Temperature (K) Method Reference Comment
63.4394.N/ADykyj, Svoboda, et al., 1999Based on data from 379. - 575. K.
61.9393.AStephenson and Malanowski, 1987Based on data from 378. - 575. K.

Enthalpy of sublimation

ΔsubH (kJ/mol) Temperature (K) Method Reference Comment
116.7 ± 2.5313.MEMortimer and Waterhouse, 1980Based on data from 302. - 324. K.

Gas phase ion energetics data

Data compiled by: Sharon G. Lias, John E. Bartmess, Joel F. Liebman, John L. Holmes, Rhoda D. Levin, and W. Gary Mallard

Ionization energy determinations

IE (eV) Method Reference Comment
7.79PETraven', Rodin, et al., 1982Vertical value

References

Dykyj, Svoboda, et al., 1999
Dykyj, J.; Svoboda, J.; Wilhoit, R.C.; Frenkel, M.L.; Hall, K.R., Vapor Pressure of Chemicals: Part A. Vapor Pressure and Antoine Constants for Hydrocarbons and Sulfur, Selenium, Tellurium and Hydrogen Containing Organic Compounds, Springer, Berlin, 1999, 373. [all data]

Stephenson and Malanowski, 1987
Stephenson, Richard M.; Malanowski, Stanislaw, Handbook of the Thermodynamics of Organic Compounds, 1987, https://doi.org/10.1007/978-94-009-3173-2 . [all data]

Mortimer and Waterhouse, 1980
Mortimer, C.T.; Waterhouse, J., Enthalpy of combustion of diphenyl diselenide, J. Chem. Thermodyn., 1980, 12, 961-965. [all data]

Traven', Rodin, et al., 1982
Traven', V.F.; Rodin, O.G.; Redchenko, V.V.; Chibisova, T.A.; Stepanov, B.I., Photoelectron spectra of selenanthrene and dibenzoselenophene, J. Gen. Chem. USSR, 1982, 52, 2345, In original 2650. [all data]